{"text_format":"1","workbook":"xlsx","n_sheets":4,"sheets":["Order Form","Office Use - Do Not Edit","VALUES","Postcodes"],"not_rendered":{"charts":0,"images":1,"macros":0,"external_links":0,"defined_names":1,"comments":0,"pivot_tables":0},"unopened":[],"bounds":{"document_bytes":16777216,"sheet_cells":100000,"rows_first":2000,"rows_last":500,"rows_between":2000,"halvings":0,"cell_chars":16384,"cell_head_chars":4096},"cells_cut":0,"cells_raw":0,"read":"whole","date_system":"1900"}

{"sheet":"Order Form","index":0,"n_rows":322,"n_cols":13,"rows_kept":322,"cut":false,"hidden":false,"merged":[[9,7,13,12],[2,4,2,5],[3,4,3,5],[12,4,12,5],[12,1,12,2],[11,4,11,5],[13,4,13,5],[6,4,6,5],[2,7,2,11],[8,7,8,12],[3,7,3,9],[15,2,15,3],[14,7,14,12],[16,7,16,12],[17,7,17,12],[18,7,18,12],[15,7,15,12],[19,1,19,12],[0,0,0,12],[18,4,18,5],[5,4,5,5],[8,4,8,5],[10,4,10,5],[15,4,15,5],[16,4,16,5],[14,4,14,5],[7,4,7,5],[9,4,9,5],[10,1,10,2],[4,4,4,5],[17,4,17,5],[16,2,16,3],[13,1,13,2]]}
["This order form is valid until 30/09/2019, to download an updated order form click here"]
[]
[null,null,null,null,"Sender/Billing Details"]
[null,null,null,"Contact Name",null,null,null,"Where did you hear about us?"]
[null,null," ","Company Name"]
[null,null,null,"Address"]
[null,null,null,"Suburb"]
[null,null,null,"State"]
[null,null,null,"Postcode",null,null,null,"See our help centre for full details relating to ordering, payment and delivery"]
[null,null,null,"Country",null,null,null,"."]
[null,"corporate@thehamperemporium.com.au ",null,"Contact Phone Number"]
[null,"1300 459 452",null,"Contact Email Address"]
[null,"PO Box 3210, Regents Park NSW 2143",null,"PO number (if applicable)"]
[null,"www.thehamperemporium.com.au/Corporate-Hampers",null,"Authority to leave hamper if recipient not present?","YES"]
[null,null,null,"Receive Tracking Numbers","YES",null,null,"1. Complete this form in full and email it to corporate@thehamperemporium.com.au"]
[null,null,"Would you like a GIFT CARD with your company logo? \nView options on our Corporate Hampers page",null,"FREE gift card",null,null,"2. Once received your salesperson will upload it to our system and send you an invoice for payment."]
[null,null,"Would you like RIBBON with your company logo?\nView options on our Corporate Hampers page",null,"No thanks",null,null,"3. If you are adding branded ribbon or gift cards, include a high res .jpg and .png logo with your order form."]
[null,null,null,"Preferred dispatch week (for orders with branded ribbon and/or branded gift tags)",null,null,null,"4. We send all our standard deliveries with Australia Post, delivery dates cannot be guaranteed with this service. See the help centre for all our delivery information."]
[null,null,null,"Requested delivery date (if your order contains branding you will not be able to select a date)"]
[null,"Please confirm all delivery addresses with your recipients prior to submitting this form, redelivery fees may apply for incorrect addresses. This form will be automatically uploaded to our system and will not be checked for errors. Please do not change the formatting of this spreadsheet.  "]
[null,"Hamper","Recipient Name","Attention Delivery","Company\n(max 50 characters)\nCompulsory for deliveries to business addresses","Address\n(max 50 characters)","Suburb","State","Postcode","Telephone","Card Message\n(max 500 characters)","Delivery Intsructions\n(max 140 characters)","(office use only)"]
[1,null,null,null,null,null,null,null,null,null,null,null,{"$f":"IFERROR(VLOOKUP(B22,VALUES!$E$2:$F$85,2,FALSE),\"\")","v":""}]
[2,null,null,null,null,null,null,null,null,null,null,null,{"$f":"IFERROR(VLOOKUP(B23,VALUES!$E$2:$F$85,2,FALSE),\"\")","v":""}]
[3,null,null,null,null,null,null,null,null,null,null,null,{"$f":"IFERROR(VLOOKUP(B24,VALUES!$E$2:$F$85,2,FALSE),\"\")","v":""}]
[4,null,null,null,null,null,null,null,null,null,null,null,{"$f":"IFERROR(VLOOKUP(B25,VALUES!$E$2:$F$85,2,FALSE),\"\")","v":""}]
[5,null,null,null,null,null,null,null,null,null,null,null,{"$f":"IFERROR(VLOOKUP(B26,VALUES!$E$2:$F$85,2,FALSE),\"\")","v":""}]
[6,null,null,null,null,null,null,null,null,null,null,null,{"$f":"IFERROR(VLOOKUP(B27,VALUES!$E$2:$F$85,2,FALSE),\"\")","v":""}]
[7,null,null,null,null,null,null,null,null,null,null,null,{"$f":"IFERROR(VLOOKUP(B28,VALUES!$E$2:$F$85,2,FALSE),\"\")","v":""}]
[8,null,null,null,null,null,null,null,null,null,null,null,{"$f":"IFERROR(VLOOKUP(B29,VALUES!$E$2:$F$85,2,FALSE),\"\")","v":""}]
[9,null,null,null,null,null,null,null,null,null,null,null,{"$f":"IFERROR(VLOOKUP(B30,VALUES!$E$2:$F$85,2,FALSE),\"\")","v":""}]
[10,null,null,null,null,null,null,null,null,null,null,null,{"$f":"IFERROR(VLOOKUP(B31,VALUES!$E$2:$F$85,2,FALSE),\"\")","v":""}]
[11,null,null,null,null,null,null,null,null,null,null,null,{"$f":"IFERROR(VLOOKUP(B32,VALUES!$E$2:$F$85,2,FALSE),\"\")","v":""}]
[12,null,null,null,null,null,null,null,null,null,null,null,{"$f":"IFERROR(VLOOKUP(B33,VALUES!$E$2:$F$85,2,FALSE),\"\")","v":""}]
[13,null,null,null,null,null,null,null,null,null,null,null,{"$f":"IFERROR(VLOOKUP(B34,VALUES!$E$2:$F$85,2,FALSE),\"\")","v":""}]
[14,null,null,null,null,null,null,null,null,null,null,null,{"$f":"IFERROR(VLOOKUP(B35,VALUES!$E$2:$F$85,2,FALSE),\"\")","v":""}]
[15,null,null,null,null,null,null,null,null,null,null,null,{"$f":"IFERROR(VLOOKUP(B36,VALUES!$E$2:$F$85,2,FALSE),\"\")","v":""}]
[16,null,null,null,null,null,null,null,null,null,null,null,{"$f":"IFERROR(VLOOKUP(B37,VALUES!$E$2:$F$85,2,FALSE),\"\")","v":""}]
[17,null,null,null,null,null,null,null,null,null,null,null,{"$f":"IFERROR(VLOOKUP(B38,VALUES!$E$2:$F$85,2,FALSE),\"\")","v":""}]
[18,null,null,null,null,null,null,null,null,null,null,null,{"$f":"IFERROR(VLOOKUP(B39,VALUES!$E$2:$F$85,2,FALSE),\"\")","v":""}]
[19,null,null,null,null,null,null,null,null,null,null,null,{"$f":"IFERROR(VLOOKUP(B40,VALUES!$E$2:$F$85,2,FALSE),\"\")","v":""}]
[20,null,null,null,null,null,null,null,null,null,null,null,{"$f":"IFERROR(VLOOKUP(B41,VALUES!$E$2:$F$85,2,FALSE),\"\")","v":""}]
[21,null,null,null,null,null,null,null,null,null,null,null,{"$f":"IFERROR(VLOOKUP(B42,VALUES!$E$2:$F$85,2,FALSE),\"\")","v":""}]
[22,null,null,null,null,null,null,null,null,null,null,null,{"$f":"IFERROR(VLOOKUP(B43,VALUES!$E$2:$F$85,2,FALSE),\"\")","v":""}]
[23,null,null,null,null,null,null,null,null,null,null,null,{"$f":"IFERROR(VLOOKUP(B44,VALUES!$E$2:$F$85,2,FALSE),\"\")","v":""}]
[24,null,null,null,null,null,null,null,null,null,null,null,{"$f":"IFERROR(VLOOKUP(B45,VALUES!$E$2:$F$85,2,FALSE),\"\")","v":""}]
[25,null,null,null,null,null,null,null,null,null,null,null,{"$f":"IFERROR(VLOOKUP(B46,VALUES!$E$2:$F$85,2,FALSE),\"\")","v":""}]
[26,null,null,null,null,null,null,null,null,null,null,null,{"$f":"IFERROR(VLOOKUP(B47,VALUES!$E$2:$F$85,2,FALSE),\"\")","v":""}]
[27,null,null,null,null,null,null,null,null,null,null,null,{"$f":"IFERROR(VLOOKUP(B48,VALUES!$E$2:$F$85,2,FALSE),\"\")","v":""}]
[28,null,null,null,null,null,null,null,null,null,null,null,{"$f":"IFERROR(VLOOKUP(B49,VALUES!$E$2:$F$85,2,FALSE),\"\")","v":""}]
[29,null,null,null,null,null,null,null,null,null,null,null,{"$f":"IFERROR(VLOOKUP(B50,VALUES!$E$2:$F$85,2,FALSE),\"\")","v":""}]
[30,null,null,null,null,null,null,null,null,null,null,null,{"$f":"IFERROR(VLOOKUP(B51,VALUES!$E$2:$F$85,2,FALSE),\"\")","v":""}]
[31,null,null,null,null,null,null,null,null,null,null,null,{"$f":"IFERROR(VLOOKUP(B52,VALUES!$E$2:$F$85,2,FALSE),\"\")","v":""}]
[32,null,null,null,null,null,null,null,null,null,null,null,{"$f":"IFERROR(VLOOKUP(B53,VALUES!$E$2:$F$85,2,FALSE),\"\")","v":""}]
[33,null,null,null,null,null,null,null,null,null,null,null,{"$f":"IFERROR(VLOOKUP(B54,VALUES!$E$2:$F$85,2,FALSE),\"\")","v":""}]
[34,null,null,null,null,null,null,null,null,null,null,null,{"$f":"IFERROR(VLOOKUP(B55,VALUES!$E$2:$F$85,2,FALSE),\"\")","v":""}]
[35,null,null,null,null,null,null,null,null,null,null,null,{"$f":"IFERROR(VLOOKUP(B56,VALUES!$E$2:$F$85,2,FALSE),\"\")","v":""}]
[36,null,null,null,null,null,null,null,null,null,null,null,{"$f":"IFERROR(VLOOKUP(B57,VALUES!$E$2:$F$85,2,FALSE),\"\")","v":""}]
[37,null,null,null,null,null,null,null,null,null,null,null,{"$f":"IFERROR(VLOOKUP(B58,VALUES!$E$2:$F$85,2,FALSE),\"\")","v":""}]
[38,null,null,null,null,null,null,null,null,null,null,null,{"$f":"IFERROR(VLOOKUP(B59,VALUES!$E$2:$F$85,2,FALSE),\"\")","v":""}]
[39,null,null,null,null,null,null,null,null,null,null,null,{"$f":"IFERROR(VLOOKUP(B60,VALUES!$E$2:$F$85,2,FALSE),\"\")","v":""}]
[40,null,null,null,null,null,null,null,null,null,null,null,{"$f":"IFERROR(VLOOKUP(B61,VALUES!$E$2:$F$85,2,FALSE),\"\")","v":""}]
[41,null,null,null,null,null,null,null,null,null,null,null,{"$f":"IFERROR(VLOOKUP(B62,VALUES!$E$2:$F$85,2,FALSE),\"\")","v":""}]
[42,null,null,null,null,null,null,null,null,null,null,null,{"$f":"IFERROR(VLOOKUP(B63,VALUES!$E$2:$F$85,2,FALSE),\"\")","v":""}]
[43,null,null,null,null,null,null,null,null,null,null,null,{"$f":"IFERROR(VLOOKUP(B64,VALUES!$E$2:$F$85,2,FALSE),\"\")","v":""}]
[44,null,null,null,null,null,null,null,null,null,null,null,{"$f":"IFERROR(VLOOKUP(B65,VALUES!$E$2:$F$85,2,FALSE),\"\")","v":""}]
[45,null,null,null,null,null,null,null,null,null,null,null,{"$f":"IFERROR(VLOOKUP(B66,VALUES!$E$2:$F$85,2,FALSE),\"\")","v":""}]
[46,null,null,null,null,null,null,null,null,null,null,null,{"$f":"IFERROR(VLOOKUP(B67,VALUES!$E$2:$F$85,2,FALSE),\"\")","v":""}]
[47,null,null,null,null,null,null,null,null,null,null,null,{"$f":"IFERROR(VLOOKUP(B68,VALUES!$E$2:$F$85,2,FALSE),\"\")","v":""}]
[48,null,null,null,null,null,null,null,null,null,null,null,{"$f":"IFERROR(VLOOKUP(B69,VALUES!$E$2:$F$85,2,FALSE),\"\")","v":""}]
[49,null,null,null,null,null,null,null,null,null,null,null,{"$f":"IFERROR(VLOOKUP(B70,VALUES!$E$2:$F$85,2,FALSE),\"\")","v":""}]
[50,null,null,null,null,null,null,null,null,null,null,null,{"$f":"IFERROR(VLOOKUP(B71,VALUES!$E$2:$F$85,2,FALSE),\"\")","v":""}]
[51,null,null,null,null,null,null,null,null,null,null,null,{"$f":"IFERROR(VLOOKUP(B72,VALUES!$E$2:$F$85,2,FALSE),\"\")","v":""}]
[52,null,null,null,null,null,null,null,null,null,null,null,{"$f":"IFERROR(VLOOKUP(B73,VALUES!$E$2:$F$85,2,FALSE),\"\")","v":""}]
[53,null,null,null,null,null,null,null,null,null,null,null,{"$f":"IFERROR(VLOOKUP(B74,VALUES!$E$2:$F$85,2,FALSE),\"\")","v":""}]
[54,null,null,null,null,null,null,null,null,null,null,null,{"$f":"IFERROR(VLOOKUP(B75,VALUES!$E$2:$F$85,2,FALSE),\"\")","v":""}]
[55,null,null,null,null,null,null,null,null,null,null,null,{"$f":"IFERROR(VLOOKUP(B76,VALUES!$E$2:$F$85,2,FALSE),\"\")","v":""}]
[56,null,null,null,null,null,null,null,null,null,null,null,{"$f":"IFERROR(VLOOKUP(B77,VALUES!$E$2:$F$85,2,FALSE),\"\")","v":""}]
[57,null,null,null,null,null,null,null,null,null,null,null,{"$f":"IFERROR(VLOOKUP(B78,VALUES!$E$2:$F$85,2,FALSE),\"\")","v":""}]
[58,null,null,null,null,null,null,null,null,null,null,null,{"$f":"IFERROR(VLOOKUP(B79,VALUES!$E$2:$F$85,2,FALSE),\"\")","v":""}]
[59,null,null,null,null,null,null,null,null,null,null,null,{"$f":"IFERROR(VLOOKUP(B80,VALUES!$E$2:$F$85,2,FALSE),\"\")","v":""}]
[60,null,null,null,null,null,null,null,null,null,null,null,{"$f":"IFERROR(VLOOKUP(B81,VALUES!$E$2:$F$85,2,FALSE),\"\")","v":""}]
[61,null,null,null,null,null,null,null,null,null,null,null,{"$f":"IFERROR(VLOOKUP(B82,VALUES!$E$2:$F$85,2,FALSE),\"\")","v":""}]
[62,null,null,null,null,null,null,null,null,null,null,null,{"$f":"IFERROR(VLOOKUP(B83,VALUES!$E$2:$F$85,2,FALSE),\"\")","v":""}]
[63,null,null,null,null,null,null,null,null,null,null,null,{"$f":"IFERROR(VLOOKUP(B84,VALUES!$E$2:$F$85,2,FALSE),\"\")","v":""}]
[64,null,null,null,null,null,null,null,null,null,null,null,{"$f":"IFERROR(VLOOKUP(B85,VALUES!$E$2:$F$85,2,FALSE),\"\")","v":""}]
[65,null,null,null,null,null,null,null,null,null,null,null,{"$f":"IFERROR(VLOOKUP(B86,VALUES!$E$2:$F$85,2,FALSE),\"\")","v":""}]
[66,null,null,null,null,null,null,null,null,null,null,null,{"$f":"IFERROR(VLOOKUP(B87,VALUES!$E$2:$F$85,2,FALSE),\"\")","v":""}]
[67,null,null,null,null,null,null,null,null,null,null,null,{"$f":"IFERROR(VLOOKUP(B88,VALUES!$E$2:$F$85,2,FALSE),\"\")","v":""}]
[68,null,null,null,null,null,null,null,null,null,null,null,{"$f":"IFERROR(VLOOKUP(B89,VALUES!$E$2:$F$85,2,FALSE),\"\")","v":""}]
[69,null,null,null,null,null,null,null,null,null,null,null,{"$f":"IFERROR(VLOOKUP(B90,VALUES!$E$2:$F$85,2,FALSE),\"\")","v":""}]
[70,null,null,null,null,null,null,null,null,null,null,null,{"$f":"IFERROR(VLOOKUP(B91,VALUES!$E$2:$F$85,2,FALSE),\"\")","v":""}]
[71,null,null,null,null,null,null,null,null,null,null,null,{"$f":"IFERROR(VLOOKUP(B92,VALUES!$E$2:$F$85,2,FALSE),\"\")","v":""}]
[72,null,null,null,null,null,null,null,null,null,null,null,{"$f":"IFERROR(VLOOKUP(B93,VALUES!$E$2:$F$85,2,FALSE),\"\")","v":""}]
[73,null,null,null,null,null,null,null,null,null,null,null,{"$f":"IFERROR(VLOOKUP(B94,VALUES!$E$2:$F$85,2,FALSE),\"\")","v":""}]
[74,null,null,null,null,null,null,null,null,null,null,null,{"$f":"IFERROR(VLOOKUP(B95,VALUES!$E$2:$F$85,2,FALSE),\"\")","v":""}]
[75,null,null,null,null,null,null,null,null,null,null,null,{"$f":"IFERROR(VLOOKUP(B96,VALUES!$E$2:$F$85,2,FALSE),\"\")","v":""}]
[76,null,null,null,null,null,null,null,null,null,null,null,{"$f":"IFERROR(VLOOKUP(B97,VALUES!$E$2:$F$85,2,FALSE),\"\")","v":""}]
[77,null,null,null,null,null,null,null,null,null,null,null,{"$f":"IFERROR(VLOOKUP(B98,VALUES!$E$2:$F$85,2,FALSE),\"\")","v":""}]
[78,null,null,null,null,null,null,null,null,null,null,null,{"$f":"IFERROR(VLOOKUP(B99,VALUES!$E$2:$F$85,2,FALSE),\"\")","v":""}]
[79,null,null,null,null,null,null,null,null,null,null,null,{"$f":"IFERROR(VLOOKUP(B100,VALUES!$E$2:$F$85,2,FALSE),\"\")","v":""}]
[80,null,null,null,null,null,null,null,null,null,null,null,{"$f":"IFERROR(VLOOKUP(B101,VALUES!$E$2:$F$85,2,FALSE),\"\")","v":""}]
[81,null,null,null,null,null,null,null,null,null,null,null,{"$f":"IFERROR(VLOOKUP(B102,VALUES!$E$2:$F$85,2,FALSE),\"\")","v":""}]
[82,null,null,null,null,null,null,null,null,null,null,null,{"$f":"IFERROR(VLOOKUP(B103,VALUES!$E$2:$F$85,2,FALSE),\"\")","v":""}]
[83,null,null,null,null,null,null,null,null,null,null,null,{"$f":"IFERROR(VLOOKUP(B104,VALUES!$E$2:$F$85,2,FALSE),\"\")","v":""}]
[84,null,null,null,null,null,null,null,null,null,null,null,{"$f":"IFERROR(VLOOKUP(B105,VALUES!$E$2:$F$85,2,FALSE),\"\")","v":""}]
[85,null,null,null,null,null,null,null,null,null,null,null,{"$f":"IFERROR(VLOOKUP(B106,VALUES!$E$2:$F$85,2,FALSE),\"\")","v":""}]
[86,null,null,null,null,null,null,null,null,null,null,null,{"$f":"IFERROR(VLOOKUP(B107,VALUES!$E$2:$F$85,2,FALSE),\"\")","v":""}]
[87,null,null,null,null,null,null,null,null,null,null,null,{"$f":"IFERROR(VLOOKUP(B108,VALUES!$E$2:$F$85,2,FALSE),\"\")","v":""}]
[88,null,null,null,null,null,null,null,null,null,null,null,{"$f":"IFERROR(VLOOKUP(B109,VALUES!$E$2:$F$85,2,FALSE),\"\")","v":""}]
[89,null,null,null,null,null,null,null,null,null,null,null,{"$f":"IFERROR(VLOOKUP(B110,VALUES!$E$2:$F$85,2,FALSE),\"\")","v":""}]
[90,null,null,null,null,null,null,null,null,null,null,null,{"$f":"IFERROR(VLOOKUP(B111,VALUES!$E$2:$F$85,2,FALSE),\"\")","v":""}]
[91,null,null,null,null,null,null,null,null,null,null,null,{"$f":"IFERROR(VLOOKUP(B112,VALUES!$E$2:$F$85,2,FALSE),\"\")","v":""}]
[92,null,null,null,null,null,null,null,null,null,null,null,{"$f":"IFERROR(VLOOKUP(B113,VALUES!$E$2:$F$85,2,FALSE),\"\")","v":""}]
[93,null,null,null,null,null,null,null,null,null,null,null,{"$f":"IFERROR(VLOOKUP(B114,VALUES!$E$2:$F$85,2,FALSE),\"\")","v":""}]
[94,null,null,null,null,null,null,null,null,null,null,null,{"$f":"IFERROR(VLOOKUP(B115,VALUES!$E$2:$F$85,2,FALSE),\"\")","v":""}]
[95,null,null,null,null,null,null,null,null,null,null,null,{"$f":"IFERROR(VLOOKUP(B116,VALUES!$E$2:$F$85,2,FALSE),\"\")","v":""}]
[96,null,null,null,null,null,null,null,null,null,null,null,{"$f":"IFERROR(VLOOKUP(B117,VALUES!$E$2:$F$85,2,FALSE),\"\")","v":""}]
[97,null,null,null,null,null,null,null,null,null,null,null,{"$f":"IFERROR(VLOOKUP(B118,VALUES!$E$2:$F$85,2,FALSE),\"\")","v":""}]
[98,null,null,null,null,null,null,null,null,null,null,null,{"$f":"IFERROR(VLOOKUP(B119,VALUES!$E$2:$F$85,2,FALSE),\"\")","v":""}]
[99,null,null,null,null,null,null,null,null,null,null,null,{"$f":"IFERROR(VLOOKUP(B120,VALUES!$E$2:$F$85,2,FALSE),\"\")","v":""}]
[100,null,null,null,null,null,null,null,null,null,null,null,{"$f":"IFERROR(VLOOKUP(B121,VALUES!$E$2:$F$85,2,FALSE),\"\")","v":""}]
[101,null,null,null,null,null,null,null,null,null,null,null,{"$f":"IFERROR(VLOOKUP(B122,VALUES!$E$2:$F$85,2,FALSE),\"\")","v":""}]
[102,null,null,null,null,null,null,null,null,null,null,null,{"$f":"IFERROR(VLOOKUP(B123,VALUES!$E$2:$F$85,2,FALSE),\"\")","v":""}]
[103,null,null,null,null,null,null,null,null,null,null,null,{"$f":"IFERROR(VLOOKUP(B124,VALUES!$E$2:$F$85,2,FALSE),\"\")","v":""}]
[104,null,null,null,null,null,null,null,null,null,null,null,{"$f":"IFERROR(VLOOKUP(B125,VALUES!$E$2:$F$85,2,FALSE),\"\")","v":""}]
[105,null,null,null,null,null,null,null,null,null,null,null,{"$f":"IFERROR(VLOOKUP(B126,VALUES!$E$2:$F$85,2,FALSE),\"\")","v":""}]
[106,null,null,null,null,null,null,null,null,null,null,null,{"$f":"IFERROR(VLOOKUP(B127,VALUES!$E$2:$F$85,2,FALSE),\"\")","v":""}]
[107,null,null,null,null,null,null,null,null,null,null,null,{"$f":"IFERROR(VLOOKUP(B128,VALUES!$E$2:$F$85,2,FALSE),\"\")","v":""}]
[108,null,null,null,null,null,null,null,null,null,null,null,{"$f":"IFERROR(VLOOKUP(B129,VALUES!$E$2:$F$85,2,FALSE),\"\")","v":""}]
[109,null,null,null,null,null,null,null,null,null,null,null,{"$f":"IFERROR(VLOOKUP(B130,VALUES!$E$2:$F$85,2,FALSE),\"\")","v":""}]
[110,null,null,null,null,null,null,null,null,null,null,null,{"$f":"IFERROR(VLOOKUP(B131,VALUES!$E$2:$F$85,2,FALSE),\"\")","v":""}]
[111,null,null,null,null,null,null,null,null,null,null,null,{"$f":"IFERROR(VLOOKUP(B132,VALUES!$E$2:$F$85,2,FALSE),\"\")","v":""}]
[112,null,null,null,null,null,null,null,null,null,null,null,{"$f":"IFERROR(VLOOKUP(B133,VALUES!$E$2:$F$85,2,FALSE),\"\")","v":""}]
[113,null,null,null,null,null,null,null,null,null,null,null,{"$f":"IFERROR(VLOOKUP(B134,VALUES!$E$2:$F$85,2,FALSE),\"\")","v":""}]
[114,null,null,null,null,null,null,null,null,null,null,null,{"$f":"IFERROR(VLOOKUP(B135,VALUES!$E$2:$F$85,2,FALSE),\"\")","v":""}]
[115,null,null,null,null,null,null,null,null,null,null,null,{"$f":"IFERROR(VLOOKUP(B136,VALUES!$E$2:$F$85,2,FALSE),\"\")","v":""}]
[116,null,null,null,null,null,null,null,null,null,null,null,{"$f":"IFERROR(VLOOKUP(B137,VALUES!$E$2:$F$85,2,FALSE),\"\")","v":""}]
[117,null,null,null,null,null,null,null,null,null,null,null,{"$f":"IFERROR(VLOOKUP(B138,VALUES!$E$2:$F$85,2,FALSE),\"\")","v":""}]
[118,null,null,null,null,null,null,null,null,null,null,null,{"$f":"IFERROR(VLOOKUP(B139,VALUES!$E$2:$F$85,2,FALSE),\"\")","v":""}]
[119,null,null,null,null,null,null,null,null,null,null,null,{"$f":"IFERROR(VLOOKUP(B140,VALUES!$E$2:$F$85,2,FALSE),\"\")","v":""}]
[120,null,null,null,null,null,null,null,null,null,null,null,{"$f":"IFERROR(VLOOKUP(B141,VALUES!$E$2:$F$85,2,FALSE),\"\")","v":""}]
[121,null,null,null,null,null,null,null,null,null,null,null,{"$f":"IFERROR(VLOOKUP(B142,VALUES!$E$2:$F$85,2,FALSE),\"\")","v":""}]
[122,null,null,null,null,null,null,null,null,null,null,null,{"$f":"IFERROR(VLOOKUP(B143,VALUES!$E$2:$F$85,2,FALSE),\"\")","v":""}]
[123,null,null,null,null,null,null,null,null,null,null,null,{"$f":"IFERROR(VLOOKUP(B144,VALUES!$E$2:$F$85,2,FALSE),\"\")","v":""}]
[124,null,null,null,null,null,null,null,null,null,null,null,{"$f":"IFERROR(VLOOKUP(B145,VALUES!$E$2:$F$85,2,FALSE),\"\")","v":""}]
[125,null,null,null,null,null,null,null,null,null,null,null,{"$f":"IFERROR(VLOOKUP(B146,VALUES!$E$2:$F$85,2,FALSE),\"\")","v":""}]
[126,null,null,null,null,null,null,null,null,null,null,null,{"$f":"IFERROR(VLOOKUP(B147,VALUES!$E$2:$F$85,2,FALSE),\"\")","v":""}]
[127,null,null,null,null,null,null,null,null,null,null,null,{"$f":"IFERROR(VLOOKUP(B148,VALUES!$E$2:$F$85,2,FALSE),\"\")","v":""}]
[128,null,null,null,null,null,null,null,null,null,null,null,{"$f":"IFERROR(VLOOKUP(B149,VALUES!$E$2:$F$85,2,FALSE),\"\")","v":""}]
[129,null,null,null,null,null,null,null,null,null,null,null,{"$f":"IFERROR(VLOOKUP(B150,VALUES!$E$2:$F$85,2,FALSE),\"\")","v":""}]
[130,null,null,null,null,null,null,null,null,null,null,null,{"$f":"IFERROR(VLOOKUP(B151,VALUES!$E$2:$F$85,2,FALSE),\"\")","v":""}]
[131,null,null,null,null,null,null,null,null,null,null,null,{"$f":"IFERROR(VLOOKUP(B152,VALUES!$E$2:$F$85,2,FALSE),\"\")","v":""}]
[132,null,null,null,null,null,null,null,null,null,null,null,{"$f":"IFERROR(VLOOKUP(B153,VALUES!$E$2:$F$85,2,FALSE),\"\")","v":""}]
[133,null,null,null,null,null,null,null,null,null,null,null,{"$f":"IFERROR(VLOOKUP(B154,VALUES!$E$2:$F$85,2,FALSE),\"\")","v":""}]
[134,null,null,null,null,null,null,null,null,null,null,null,{"$f":"IFERROR(VLOOKUP(B155,VALUES!$E$2:$F$85,2,FALSE),\"\")","v":""}]
[135,null,null,null,null,null,null,null,null,null,null,null,{"$f":"IFERROR(VLOOKUP(B156,VALUES!$E$2:$F$85,2,FALSE),\"\")","v":""}]
[136,null,null,null,null,null,null,null,null,null,null,null,{"$f":"IFERROR(VLOOKUP(B157,VALUES!$E$2:$F$85,2,FALSE),\"\")","v":""}]
[137,null,null,null,null,null,null,null,null,null,null,null,{"$f":"IFERROR(VLOOKUP(B158,VALUES!$E$2:$F$85,2,FALSE),\"\")","v":""}]
[138,null,null,null,null,null,null,null,null,null,null,null,{"$f":"IFERROR(VLOOKUP(B159,VALUES!$E$2:$F$85,2,FALSE),\"\")","v":""}]
[139,null,null,null,null,null,null,null,null,null,null,null,{"$f":"IFERROR(VLOOKUP(B160,VALUES!$E$2:$F$85,2,FALSE),\"\")","v":""}]
[140,null,null,null,null,null,null,null,null,null,null,null,{"$f":"IFERROR(VLOOKUP(B161,VALUES!$E$2:$F$85,2,FALSE),\"\")","v":""}]
[141,null,null,null,null,null,null,null,null,null,null,null,{"$f":"IFERROR(VLOOKUP(B162,VALUES!$E$2:$F$85,2,FALSE),\"\")","v":""}]
[142,null,null,null,null,null,null,null,null,null,null,null,{"$f":"IFERROR(VLOOKUP(B163,VALUES!$E$2:$F$85,2,FALSE),\"\")","v":""}]
[143,null,null,null,null,null,null,null,null,null,null,null,{"$f":"IFERROR(VLOOKUP(B164,VALUES!$E$2:$F$85,2,FALSE),\"\")","v":""}]
[144,null,null,null,null,null,null,null,null,null,null,null,{"$f":"IFERROR(VLOOKUP(B165,VALUES!$E$2:$F$85,2,FALSE),\"\")","v":""}]
[145,null,null,null,null,null,null,null,null,null,null,null,{"$f":"IFERROR(VLOOKUP(B166,VALUES!$E$2:$F$85,2,FALSE),\"\")","v":""}]
[146,null,null,null,null,null,null,null,null,null,null,null,{"$f":"IFERROR(VLOOKUP(B167,VALUES!$E$2:$F$85,2,FALSE),\"\")","v":""}]
[147,null,null,null,null,null,null,null,null,null,null,null,{"$f":"IFERROR(VLOOKUP(B168,VALUES!$E$2:$F$85,2,FALSE),\"\")","v":""}]
[148,null,null,null,null,null,null,null,null,null,null,null,{"$f":"IFERROR(VLOOKUP(B169,VALUES!$E$2:$F$85,2,FALSE),\"\")","v":""}]
[149,null,null,null,null,null,null,null,null,null,null,null,{"$f":"IFERROR(VLOOKUP(B170,VALUES!$E$2:$F$85,2,FALSE),\"\")","v":""}]
[150,null,null,null,null,null,null,null,null,null,null,null,{"$f":"IFERROR(VLOOKUP(B171,VALUES!$E$2:$F$85,2,FALSE),\"\")","v":""}]
[151,null,null,null,null,null,null,null,null,null,null,null,{"$f":"IFERROR(VLOOKUP(B172,VALUES!$E$2:$F$85,2,FALSE),\"\")","v":""}]
[152,null,null,null,null,null,null,null,null,null,null,null,{"$f":"IFERROR(VLOOKUP(B173,VALUES!$E$2:$F$85,2,FALSE),\"\")","v":""}]
[153,null,null,null,null,null,null,null,null,null,null,null,{"$f":"IFERROR(VLOOKUP(B174,VALUES!$E$2:$F$85,2,FALSE),\"\")","v":""}]
[154,null,null,null,null,null,null,null,null,null,null,null,{"$f":"IFERROR(VLOOKUP(B175,VALUES!$E$2:$F$85,2,FALSE),\"\")","v":""}]
[155,null,null,null,null,null,null,null,null,null,null,null,{"$f":"IFERROR(VLOOKUP(B176,VALUES!$E$2:$F$85,2,FALSE),\"\")","v":""}]
[156,null,null,null,null,null,null,null,null,null,null,null,{"$f":"IFERROR(VLOOKUP(B177,VALUES!$E$2:$F$85,2,FALSE),\"\")","v":""}]
[157,null,null,null,null,null,null,null,null,null,null,null,{"$f":"IFERROR(VLOOKUP(B178,VALUES!$E$2:$F$85,2,FALSE),\"\")","v":""}]
[158,null,null,null,null,null,null,null,null,null,null,null,{"$f":"IFERROR(VLOOKUP(B179,VALUES!$E$2:$F$85,2,FALSE),\"\")","v":""}]
[159,null,null,null,null,null,null,null,null,null,null,null,{"$f":"IFERROR(VLOOKUP(B180,VALUES!$E$2:$F$85,2,FALSE),\"\")","v":""}]
[160,null,null,null,null,null,null,null,null,null,null,null,{"$f":"IFERROR(VLOOKUP(B181,VALUES!$E$2:$F$85,2,FALSE),\"\")","v":""}]
[161,null,null,null,null,null,null,null,null,null,null,null,{"$f":"IFERROR(VLOOKUP(B182,VALUES!$E$2:$F$85,2,FALSE),\"\")","v":""}]
[162,null,null,null,null,null,null,null,null,null,null,null,{"$f":"IFERROR(VLOOKUP(B183,VALUES!$E$2:$F$85,2,FALSE),\"\")","v":""}]
[163,null,null,null,null,null,null,null,null,null,null,null,{"$f":"IFERROR(VLOOKUP(B184,VALUES!$E$2:$F$85,2,FALSE),\"\")","v":""}]
[164,null,null,null,null,null,null,null,null,null,null,null,{"$f":"IFERROR(VLOOKUP(B185,VALUES!$E$2:$F$85,2,FALSE),\"\")","v":""}]
[165,null,null,null,null,null,null,null,null,null,null,null,{"$f":"IFERROR(VLOOKUP(B186,VALUES!$E$2:$F$85,2,FALSE),\"\")","v":""}]
[166,null,null,null,null,null,null,null,null,null,null,null,{"$f":"IFERROR(VLOOKUP(B187,VALUES!$E$2:$F$85,2,FALSE),\"\")","v":""}]
[167,null,null,null,null,null,null,null,null,null,null,null,{"$f":"IFERROR(VLOOKUP(B188,VALUES!$E$2:$F$85,2,FALSE),\"\")","v":""}]
[168,null,null,null,null,null,null,null,null,null,null,null,{"$f":"IFERROR(VLOOKUP(B189,VALUES!$E$2:$F$85,2,FALSE),\"\")","v":""}]
[169,null,null,null,null,null,null,null,null,null,null,null,{"$f":"IFERROR(VLOOKUP(B190,VALUES!$E$2:$F$85,2,FALSE),\"\")","v":""}]
[170,null,null,null,null,null,null,null,null,null,null,null,{"$f":"IFERROR(VLOOKUP(B191,VALUES!$E$2:$F$85,2,FALSE),\"\")","v":""}]
[171,null,null,null,null,null,null,null,null,null,null,null,{"$f":"IFERROR(VLOOKUP(B192,VALUES!$E$2:$F$85,2,FALSE),\"\")","v":""}]
[172,null,null,null,null,null,null,null,null,null,null,null,{"$f":"IFERROR(VLOOKUP(B193,VALUES!$E$2:$F$85,2,FALSE),\"\")","v":""}]
[173,null,null,null,null,null,null,null,null,null,null,null,{"$f":"IFERROR(VLOOKUP(B194,VALUES!$E$2:$F$85,2,FALSE),\"\")","v":""}]
[174,null,null,null,null,null,null,null,null,null,null,null,{"$f":"IFERROR(VLOOKUP(B195,VALUES!$E$2:$F$85,2,FALSE),\"\")","v":""}]
[175,null,null,null,null,null,null,null,null,null,null,null,{"$f":"IFERROR(VLOOKUP(B196,VALUES!$E$2:$F$85,2,FALSE),\"\")","v":""}]
[176,null,null,null,null,null,null,null,null,null,null,null,{"$f":"IFERROR(VLOOKUP(B197,VALUES!$E$2:$F$85,2,FALSE),\"\")","v":""}]
[177,null,null,null,null,null,null,null,null,null,null,null,{"$f":"IFERROR(VLOOKUP(B198,VALUES!$E$2:$F$85,2,FALSE),\"\")","v":""}]
[178,null,null,null,null,null,null,null,null,null,null,null,{"$f":"IFERROR(VLOOKUP(B199,VALUES!$E$2:$F$85,2,FALSE),\"\")","v":""}]
[179,null,null,null,null,null,null,null,null,null,null,null,{"$f":"IFERROR(VLOOKUP(B200,VALUES!$E$2:$F$85,2,FALSE),\"\")","v":""}]
[180,null,null,null,null,null,null,null,null,null,null,null,{"$f":"IFERROR(VLOOKUP(B201,VALUES!$E$2:$F$85,2,FALSE),\"\")","v":""}]
[181,null,null,null,null,null,null,null,null,null,null,null,{"$f":"IFERROR(VLOOKUP(B202,VALUES!$E$2:$F$85,2,FALSE),\"\")","v":""}]
[182,null,null,null,null,null,null,null,null,null,null,null,{"$f":"IFERROR(VLOOKUP(B203,VALUES!$E$2:$F$85,2,FALSE),\"\")","v":""}]
[183,null,null,null,null,null,null,null,null,null,null,null,{"$f":"IFERROR(VLOOKUP(B204,VALUES!$E$2:$F$85,2,FALSE),\"\")","v":""}]
[184,null,null,null,null,null,null,null,null,null,null,null,{"$f":"IFERROR(VLOOKUP(B205,VALUES!$E$2:$F$85,2,FALSE),\"\")","v":""}]
[185,null,null,null,null,null,null,null,null,null,null,null,{"$f":"IFERROR(VLOOKUP(B206,VALUES!$E$2:$F$85,2,FALSE),\"\")","v":""}]
[186,null,null,null,null,null,null,null,null,null,null,null,{"$f":"IFERROR(VLOOKUP(B207,VALUES!$E$2:$F$85,2,FALSE),\"\")","v":""}]
[187,null,null,null,null,null,null,null,null,null,null,null,{"$f":"IFERROR(VLOOKUP(B208,VALUES!$E$2:$F$85,2,FALSE),\"\")","v":""}]
[188,null,null,null,null,null,null,null,null,null,null,null,{"$f":"IFERROR(VLOOKUP(B209,VALUES!$E$2:$F$85,2,FALSE),\"\")","v":""}]
[189,null,null,null,null,null,null,null,null,null,null,null,{"$f":"IFERROR(VLOOKUP(B210,VALUES!$E$2:$F$85,2,FALSE),\"\")","v":""}]
[190,null,null,null,null,null,null,null,null,null,null,null,{"$f":"IFERROR(VLOOKUP(B211,VALUES!$E$2:$F$85,2,FALSE),\"\")","v":""}]
[191,null,null,null,null,null,null,null,null,null,null,null,{"$f":"IFERROR(VLOOKUP(B212,VALUES!$E$2:$F$85,2,FALSE),\"\")","v":""}]
[192,null,null,null,null,null,null,null,null,null,null,null,{"$f":"IFERROR(VLOOKUP(B213,VALUES!$E$2:$F$85,2,FALSE),\"\")","v":""}]
[193,null,null,null,null,null,null,null,null,null,null,null,{"$f":"IFERROR(VLOOKUP(B214,VALUES!$E$2:$F$85,2,FALSE),\"\")","v":""}]
[194,null,null,null,null,null,null,null,null,null,null,null,{"$f":"IFERROR(VLOOKUP(B215,VALUES!$E$2:$F$85,2,FALSE),\"\")","v":""}]
[195,null,null,null,null,null,null,null,null,null,null,null,{"$f":"IFERROR(VLOOKUP(B216,VALUES!$E$2:$F$85,2,FALSE),\"\")","v":""}]
[196,null,null,null,null,null,null,null,null,null,null,null,{"$f":"IFERROR(VLOOKUP(B217,VALUES!$E$2:$F$85,2,FALSE),\"\")","v":""}]
[197,null,null,null,null,null,null,null,null,null,null,null,{"$f":"IFERROR(VLOOKUP(B218,VALUES!$E$2:$F$85,2,FALSE),\"\")","v":""}]
[198,null,null,null,null,null,null,null,null,null,null,null,{"$f":"IFERROR(VLOOKUP(B219,VALUES!$E$2:$F$85,2,FALSE),\"\")","v":""}]
[199,null,null,null,null,null,null,null,null,null,null,null,{"$f":"IFERROR(VLOOKUP(B220,VALUES!$E$2:$F$85,2,FALSE),\"\")","v":""}]
[200,null,null,null,null,null,null,null,null,null,null,null,{"$f":"IFERROR(VLOOKUP(B221,VALUES!$E$2:$F$85,2,FALSE),\"\")","v":""}]
[201,null,null,null,null,null,null,null,null,null,null,null,{"$f":"IFERROR(VLOOKUP(B222,VALUES!$E$2:$F$85,2,FALSE),\"\")","v":""}]
[202,null,null,null,null,null,null,null,null,null,null,null,{"$f":"IFERROR(VLOOKUP(B223,VALUES!$E$2:$F$85,2,FALSE),\"\")","v":""}]
[203,null,null,null,null,null,null,null,null,null,null,null,{"$f":"IFERROR(VLOOKUP(B224,VALUES!$E$2:$F$85,2,FALSE),\"\")","v":""}]
[204,null,null,null,null,null,null,null,null,null,null,null,{"$f":"IFERROR(VLOOKUP(B225,VALUES!$E$2:$F$85,2,FALSE),\"\")","v":""}]
[205,null,null,null,null,null,null,null,null,null,null,null,{"$f":"IFERROR(VLOOKUP(B226,VALUES!$E$2:$F$85,2,FALSE),\"\")","v":""}]
[206,null,null,null,null,null,null,null,null,null,null,null,{"$f":"IFERROR(VLOOKUP(B227,VALUES!$E$2:$F$85,2,FALSE),\"\")","v":""}]
[207,null,null,null,null,null,null,null,null,null,null,null,{"$f":"IFERROR(VLOOKUP(B228,VALUES!$E$2:$F$85,2,FALSE),\"\")","v":""}]
[208,null,null,null,null,null,null,null,null,null,null,null,{"$f":"IFERROR(VLOOKUP(B229,VALUES!$E$2:$F$85,2,FALSE),\"\")","v":""}]
[209,null,null,null,null,null,null,null,null,null,null,null,{"$f":"IFERROR(VLOOKUP(B230,VALUES!$E$2:$F$85,2,FALSE),\"\")","v":""}]
[210,null,null,null,null,null,null,null,null,null,null,null,{"$f":"IFERROR(VLOOKUP(B231,VALUES!$E$2:$F$85,2,FALSE),\"\")","v":""}]
[211,null,null,null,null,null,null,null,null,null,null,null,{"$f":"IFERROR(VLOOKUP(B232,VALUES!$E$2:$F$85,2,FALSE),\"\")","v":""}]
[212,null,null,null,null,null,null,null,null,null,null,null,{"$f":"IFERROR(VLOOKUP(B233,VALUES!$E$2:$F$85,2,FALSE),\"\")","v":""}]
[213,null,null,null,null,null,null,null,null,null,null,null,{"$f":"IFERROR(VLOOKUP(B234,VALUES!$E$2:$F$85,2,FALSE),\"\")","v":""}]
[214,null,null,null,null,null,null,null,null,null,null,null,{"$f":"IFERROR(VLOOKUP(B235,VALUES!$E$2:$F$85,2,FALSE),\"\")","v":""}]
[215,null,null,null,null,null,null,null,null,null,null,null,{"$f":"IFERROR(VLOOKUP(B236,VALUES!$E$2:$F$85,2,FALSE),\"\")","v":""}]
[216,null,null,null,null,null,null,null,null,null,null,null,{"$f":"IFERROR(VLOOKUP(B237,VALUES!$E$2:$F$85,2,FALSE),\"\")","v":""}]
[217,null,null,null,null,null,null,null,null,null,null,null,{"$f":"IFERROR(VLOOKUP(B238,VALUES!$E$2:$F$85,2,FALSE),\"\")","v":""}]
[218,null,null,null,null,null,null,null,null,null,null,null,{"$f":"IFERROR(VLOOKUP(B239,VALUES!$E$2:$F$85,2,FALSE),\"\")","v":""}]
[219,null,null,null,null,null,null,null,null,null,null,null,{"$f":"IFERROR(VLOOKUP(B240,VALUES!$E$2:$F$85,2,FALSE),\"\")","v":""}]
[220,null,null,null,null,null,null,null,null,null,null,null,{"$f":"IFERROR(VLOOKUP(B241,VALUES!$E$2:$F$85,2,FALSE),\"\")","v":""}]
[221,null,null,null,null,null,null,null,null,null,null,null,{"$f":"IFERROR(VLOOKUP(B242,VALUES!$E$2:$F$85,2,FALSE),\"\")","v":""}]
[222,null,null,null,null,null,null,null,null,null,null,null,{"$f":"IFERROR(VLOOKUP(B243,VALUES!$E$2:$F$85,2,FALSE),\"\")","v":""}]
[223,null,null,null,null,null,null,null,null,null,null,null,{"$f":"IFERROR(VLOOKUP(B244,VALUES!$E$2:$F$85,2,FALSE),\"\")","v":""}]
[224,null,null,null,null,null,null,null,null,null,null,null,{"$f":"IFERROR(VLOOKUP(B245,VALUES!$E$2:$F$85,2,FALSE),\"\")","v":""}]
[225,null,null,null,null,null,null,null,null,null,null,null,{"$f":"IFERROR(VLOOKUP(B246,VALUES!$E$2:$F$85,2,FALSE),\"\")","v":""}]
[226,null,null,null,null,null,null,null,null,null,null,null,{"$f":"IFERROR(VLOOKUP(B247,VALUES!$E$2:$F$85,2,FALSE),\"\")","v":""}]
[227,null,null,null,null,null,null,null,null,null,null,null,{"$f":"IFERROR(VLOOKUP(B248,VALUES!$E$2:$F$85,2,FALSE),\"\")","v":""}]
[228,null,null,null,null,null,null,null,null,null,null,null,{"$f":"IFERROR(VLOOKUP(B249,VALUES!$E$2:$F$85,2,FALSE),\"\")","v":""}]
[229,null,null,null,null,null,null,null,null,null,null,null,{"$f":"IFERROR(VLOOKUP(B250,VALUES!$E$2:$F$85,2,FALSE),\"\")","v":""}]
[230,null,null,null,null,null,null,null,null,null,null,null,{"$f":"IFERROR(VLOOKUP(B251,VALUES!$E$2:$F$85,2,FALSE),\"\")","v":""}]
[231,null,null,null,null,null,null,null,null,null,null,null,{"$f":"IFERROR(VLOOKUP(B252,VALUES!$E$2:$F$85,2,FALSE),\"\")","v":""}]
[232,null,null,null,null,null,null,null,null,null,null,null,{"$f":"IFERROR(VLOOKUP(B253,VALUES!$E$2:$F$85,2,FALSE),\"\")","v":""}]
[233,null,null,null,null,null,null,null,null,null,null,null,{"$f":"IFERROR(VLOOKUP(B254,VALUES!$E$2:$F$85,2,FALSE),\"\")","v":""}]
[234,null,null,null,null,null,null,null,null,null,null,null,{"$f":"IFERROR(VLOOKUP(B255,VALUES!$E$2:$F$85,2,FALSE),\"\")","v":""}]
[235,null,null,null,null,null,null,null,null,null,null,null,{"$f":"IFERROR(VLOOKUP(B256,VALUES!$E$2:$F$85,2,FALSE),\"\")","v":""}]
[236,null,null,null,null,null,null,null,null,null,null,null,{"$f":"IFERROR(VLOOKUP(B257,VALUES!$E$2:$F$85,2,FALSE),\"\")","v":""}]
[237,null,null,null,null,null,null,null,null,null,null,null,{"$f":"IFERROR(VLOOKUP(B258,VALUES!$E$2:$F$85,2,FALSE),\"\")","v":""}]
[238,null,null,null,null,null,null,null,null,null,null,null,{"$f":"IFERROR(VLOOKUP(B259,VALUES!$E$2:$F$85,2,FALSE),\"\")","v":""}]
[239,null,null,null,null,null,null,null,null,null,null,null,{"$f":"IFERROR(VLOOKUP(B260,VALUES!$E$2:$F$85,2,FALSE),\"\")","v":""}]
[240,null,null,null,null,null,null,null,null,null,null,null,{"$f":"IFERROR(VLOOKUP(B261,VALUES!$E$2:$F$85,2,FALSE),\"\")","v":""}]
[241,null,null,null,null,null,null,null,null,null,null,null,{"$f":"IFERROR(VLOOKUP(B262,VALUES!$E$2:$F$85,2,FALSE),\"\")","v":""}]
[242,null,null,null,null,null,null,null,null,null,null,null,{"$f":"IFERROR(VLOOKUP(B263,VALUES!$E$2:$F$85,2,FALSE),\"\")","v":""}]
[243,null,null,null,null,null,null,null,null,null,null,null,{"$f":"IFERROR(VLOOKUP(B264,VALUES!$E$2:$F$85,2,FALSE),\"\")","v":""}]
[244,null,null,null,null,null,null,null,null,null,null,null,{"$f":"IFERROR(VLOOKUP(B265,VALUES!$E$2:$F$85,2,FALSE),\"\")","v":""}]
[245,null,null,null,null,null,null,null,null,null,null,null,{"$f":"IFERROR(VLOOKUP(B266,VALUES!$E$2:$F$85,2,FALSE),\"\")","v":""}]
[246,null,null,null,null,null,null,null,null,null,null,null,{"$f":"IFERROR(VLOOKUP(B267,VALUES!$E$2:$F$85,2,FALSE),\"\")","v":""}]
[247,null,null,null,null,null,null,null,null,null,null,null,{"$f":"IFERROR(VLOOKUP(B268,VALUES!$E$2:$F$85,2,FALSE),\"\")","v":""}]
[248,null,null,null,null,null,null,null,null,null,null,null,{"$f":"IFERROR(VLOOKUP(B269,VALUES!$E$2:$F$85,2,FALSE),\"\")","v":""}]
[249,null,null,null,null,null,null,null,null,null,null,null,{"$f":"IFERROR(VLOOKUP(B270,VALUES!$E$2:$F$85,2,FALSE),\"\")","v":""}]
[250,null,null,null,null,null,null,null,null,null,null,null,{"$f":"IFERROR(VLOOKUP(B271,VALUES!$E$2:$F$85,2,FALSE),\"\")","v":""}]
[251,null,null,null,null,null,null,null,null,null,null,null,{"$f":"IFERROR(VLOOKUP(B272,VALUES!$E$2:$F$85,2,FALSE),\"\")","v":""}]
[252,null,null,null,null,null,null,null,null,null,null,null,{"$f":"IFERROR(VLOOKUP(B273,VALUES!$E$2:$F$85,2,FALSE),\"\")","v":""}]
[253,null,null,null,null,null,null,null,null,null,null,null,{"$f":"IFERROR(VLOOKUP(B274,VALUES!$E$2:$F$85,2,FALSE),\"\")","v":""}]
[254,null,null,null,null,null,null,null,null,null,null,null,{"$f":"IFERROR(VLOOKUP(B275,VALUES!$E$2:$F$85,2,FALSE),\"\")","v":""}]
[255,null,null,null,null,null,null,null,null,null,null,null,{"$f":"IFERROR(VLOOKUP(B276,VALUES!$E$2:$F$85,2,FALSE),\"\")","v":""}]
[256,null,null,null,null,null,null,null,null,null,null,null,{"$f":"IFERROR(VLOOKUP(B277,VALUES!$E$2:$F$85,2,FALSE),\"\")","v":""}]
[257,null,null,null,null,null,null,null,null,null,null,null,{"$f":"IFERROR(VLOOKUP(B278,VALUES!$E$2:$F$85,2,FALSE),\"\")","v":""}]
[258,null,null,null,null,null,null,null,null,null,null,null,{"$f":"IFERROR(VLOOKUP(B279,VALUES!$E$2:$F$85,2,FALSE),\"\")","v":""}]
[259,null,null,null,null,null,null,null,null,null,null,null,{"$f":"IFERROR(VLOOKUP(B280,VALUES!$E$2:$F$85,2,FALSE),\"\")","v":""}]
[260,null,null,null,null,null,null,null,null,null,null,null,{"$f":"IFERROR(VLOOKUP(B281,VALUES!$E$2:$F$85,2,FALSE),\"\")","v":""}]
[261,null,null,null,null,null,null,null,null,null,null,null,{"$f":"IFERROR(VLOOKUP(B282,VALUES!$E$2:$F$85,2,FALSE),\"\")","v":""}]
[262,null,null,null,null,null,null,null,null,null,null,null,{"$f":"IFERROR(VLOOKUP(B283,VALUES!$E$2:$F$85,2,FALSE),\"\")","v":""}]
[263,null,null,null,null,null,null,null,null,null,null,null,{"$f":"IFERROR(VLOOKUP(B284,VALUES!$E$2:$F$85,2,FALSE),\"\")","v":""}]
[264,null,null,null,null,null,null,null,null,null,null,null,{"$f":"IFERROR(VLOOKUP(B285,VALUES!$E$2:$F$85,2,FALSE),\"\")","v":""}]
[265,null,null,null,null,null,null,null,null,null,null,null,{"$f":"IFERROR(VLOOKUP(B286,VALUES!$E$2:$F$85,2,FALSE),\"\")","v":""}]
[266,null,null,null,null,null,null,null,null,null,null,null,{"$f":"IFERROR(VLOOKUP(B287,VALUES!$E$2:$F$85,2,FALSE),\"\")","v":""}]
[267,null,null,null,null,null,null,null,null,null,null,null,{"$f":"IFERROR(VLOOKUP(B288,VALUES!$E$2:$F$85,2,FALSE),\"\")","v":""}]
[268,null,null,null,null,null,null,null,null,null,null,null,{"$f":"IFERROR(VLOOKUP(B289,VALUES!$E$2:$F$85,2,FALSE),\"\")","v":""}]
[269,null,null,null,null,null,null,null,null,null,null,null,{"$f":"IFERROR(VLOOKUP(B290,VALUES!$E$2:$F$85,2,FALSE),\"\")","v":""}]
[270,null,null,null,null,null,null,null,null,null,null,null,{"$f":"IFERROR(VLOOKUP(B291,VALUES!$E$2:$F$85,2,FALSE),\"\")","v":""}]
[271,null,null,null,null,null,null,null,null,null,null,null,{"$f":"IFERROR(VLOOKUP(B292,VALUES!$E$2:$F$85,2,FALSE),\"\")","v":""}]
[272,null,null,null,null,null,null,null,null,null,null,null,{"$f":"IFERROR(VLOOKUP(B293,VALUES!$E$2:$F$85,2,FALSE),\"\")","v":""}]
[273,null,null,null,null,null,null,null,null,null,null,null,{"$f":"IFERROR(VLOOKUP(B294,VALUES!$E$2:$F$85,2,FALSE),\"\")","v":""}]
[274,null,null,null,null,null,null,null,null,null,null,null,{"$f":"IFERROR(VLOOKUP(B295,VALUES!$E$2:$F$85,2,FALSE),\"\")","v":""}]
[275,null,null,null,null,null,null,null,null,null,null,null,{"$f":"IFERROR(VLOOKUP(B296,VALUES!$E$2:$F$85,2,FALSE),\"\")","v":""}]
[276,null,null,null,null,null,null,null,null,null,null,null,{"$f":"IFERROR(VLOOKUP(B297,VALUES!$E$2:$F$85,2,FALSE),\"\")","v":""}]
[277,null,null,null,null,null,null,null,null,null,null,null,{"$f":"IFERROR(VLOOKUP(B298,VALUES!$E$2:$F$85,2,FALSE),\"\")","v":""}]
[278,null,null,null,null,null,null,null,null,null,null,null,{"$f":"IFERROR(VLOOKUP(B299,VALUES!$E$2:$F$85,2,FALSE),\"\")","v":""}]
[279,null,null,null,null,null,null,null,null,null,null,null,{"$f":"IFERROR(VLOOKUP(B300,VALUES!$E$2:$F$85,2,FALSE),\"\")","v":""}]
[280,null,null,null,null,null,null,null,null,null,null,null,{"$f":"IFERROR(VLOOKUP(B301,VALUES!$E$2:$F$85,2,FALSE),\"\")","v":""}]
[281,null,null,null,null,null,null,null,null,null,null,null,{"$f":"IFERROR(VLOOKUP(B302,VALUES!$E$2:$F$85,2,FALSE),\"\")","v":""}]
[282,null,null,null,null,null,null,null,null,null,null,null,{"$f":"IFERROR(VLOOKUP(B303,VALUES!$E$2:$F$85,2,FALSE),\"\")","v":""}]
[283,null,null,null,null,null,null,null,null,null,null,null,{"$f":"IFERROR(VLOOKUP(B304,VALUES!$E$2:$F$85,2,FALSE),\"\")","v":""}]
[284,null,null,null,null,null,null,null,null,null,null,null,{"$f":"IFERROR(VLOOKUP(B305,VALUES!$E$2:$F$85,2,FALSE),\"\")","v":""}]
[285,null,null,null,null,null,null,null,null,null,null,null,{"$f":"IFERROR(VLOOKUP(B306,VALUES!$E$2:$F$85,2,FALSE),\"\")","v":""}]
[286,null,null,null,null,null,null,null,null,null,null,null,{"$f":"IFERROR(VLOOKUP(B307,VALUES!$E$2:$F$85,2,FALSE),\"\")","v":""}]
[287,null,null,null,null,null,null,null,null,null,null,null,{"$f":"IFERROR(VLOOKUP(B308,VALUES!$E$2:$F$85,2,FALSE),\"\")","v":""}]
[288,null,null,null,null,null,null,null,null,null,null,null,{"$f":"IFERROR(VLOOKUP(B309,VALUES!$E$2:$F$85,2,FALSE),\"\")","v":""}]
[289,null,null,null,null,null,null,null,null,null,null,null,{"$f":"IFERROR(VLOOKUP(B310,VALUES!$E$2:$F$85,2,FALSE),\"\")","v":""}]
[290,null,null,null,null,null,null,null,null,null,null,null,{"$f":"IFERROR(VLOOKUP(B311,VALUES!$E$2:$F$85,2,FALSE),\"\")","v":""}]
[291,null,null,null,null,null,null,null,null,null,null,null,{"$f":"IFERROR(VLOOKUP(B312,VALUES!$E$2:$F$85,2,FALSE),\"\")","v":""}]
[292,null,null,null,null,null,null,null,null,null,null,null,{"$f":"IFERROR(VLOOKUP(B313,VALUES!$E$2:$F$85,2,FALSE),\"\")","v":""}]
[293,null,null,null,null,null,null,null,null,null,null,null,{"$f":"IFERROR(VLOOKUP(B314,VALUES!$E$2:$F$85,2,FALSE),\"\")","v":""}]
[294,null,null,null,null,null,null,null,null,null,null,null,{"$f":"IFERROR(VLOOKUP(B315,VALUES!$E$2:$F$85,2,FALSE),\"\")","v":""}]
[295,null,null,null,null,null,null,null,null,null,null,null,{"$f":"IFERROR(VLOOKUP(B316,VALUES!$E$2:$F$85,2,FALSE),\"\")","v":""}]
[296,null,null,null,null,null,null,null,null,null,null,null,{"$f":"IFERROR(VLOOKUP(B317,VALUES!$E$2:$F$85,2,FALSE),\"\")","v":""}]
[297,null,null,null,null,null,null,null,null,null,null,null,{"$f":"IFERROR(VLOOKUP(B318,VALUES!$E$2:$F$85,2,FALSE),\"\")","v":""}]
[298,null,null,null,null,null,null,null,null,null,null,null,{"$f":"IFERROR(VLOOKUP(B319,VALUES!$E$2:$F$85,2,FALSE),\"\")","v":""}]
[299,null,null,null,null,null,null,null,null,null,null,null,{"$f":"IFERROR(VLOOKUP(B320,VALUES!$E$2:$F$85,2,FALSE),\"\")","v":""}]
[300,null,null,null,null,null,null,null,null,null,null,null,{"$f":"IFERROR(VLOOKUP(B321,VALUES!$E$2:$F$85,2,FALSE),\"\")","v":""}]
[301,null,null,null,null,null,null,null,null,null,null,null,{"$f":"IFERROR(VLOOKUP(B322,VALUES!$E$2:$F$85,2,FALSE),\"\")","v":""}]

{"sheet":"Office Use - Do Not Edit","index":1,"n_rows":302,"n_cols":41,"rows_kept":302,"cut":false,"hidden":true,"merged":[]}
["ID","sku","bill name","bill company","bill address","bill suburb","bill post code","bill state","bill country","bill phone","email address",null,"ship name","ship company","ship address","ship post code","ship suburb","ship state","ship phone","delivery instructions","recipient name","card message","authority to leave","date required","card design","ribbon colour","add logo to gift card","add logo to ribbon","X warehouse notes","corporate notes","X customer service notes","X username","X sales person","shipping method","C approved","price","hamper discount","shipping discount","payment method","amount paid","asap"]
[{"$f":"'Order Form'!A22","v":1},{"$f":"'Order Form'!M22","v":""},{"$f":"'Order Form'!$E$4","v":0},{"$f":"'Order Form'!$E$5","v":0},{"$f":"'Order Form'!$E$6","v":0},{"$f":"'Order Form'!$E$7","v":0},{"$f":"'Order Form'!$E$9","v":0},{"$f":"'Order Form'!$E$8","v":0},{"$f":"'Order Form'!$E$10","v":0},{"$f":"'Order Form'!$E$11","v":0},{"$f":"IF(('Order Form'!$E$15=\"YES\"),'Order Form'!$E$12,\"\")","v":0},{"$f":"'Order Form'!$E$13 & \"\"","v":""},{"$f":"IF('Order Form'!D22=\"\",'Order Form'!C22,'Order Form'!D22) & \"\"","v":""},{"$f":"'Order Form'!E22 & \"\"","v":""},{"$f":"'Order Form'!F22","v":0},{"$f":"'Order Form'!I22","v":0},{"$f":"'Order Form'!G22","v":0},{"$f":"'Order Form'!H22","v":0},{"$f":"'Order Form'!J22 & \"\"","v":""},{"$f":"'Order Form'!L22 & \"\"","v":""},{"$f":"'Order Form'!C22 & \"\"","v":""},{"$f":"'Order Form'!K22 & \"\"","v":""},{"$f":"'Order Form'!$E$14","v":"YES"},{"$f":"'Order Form'!$E$19","v":0},{"$f":"'Order Form'!$E$16","v":"FREE gift card"},{"$f":"'Order Form'!$E$17","v":"No thanks"},{"$f":"IF(OR(Y2=\"FREE gift card\",Y2=\"No Cards\"),\"No\",\"Yes\")","v":"No"},{"$f":"IF($Z$2=\"No thanks\",\"No\",\"Yes\")","v":"No"},{"$f":"\"Dispatch Week: \"&'Order Form'!$E$18","v":"Dispatch Week: "},{"$f":"\"VIP: \"&'Order Form'!$E$5 &\"; Rib: \"&'Order Form'!$E$17 &\"; GT: \"&'Order Form'!$E$16","v":"VIP: ; Rib: No thanks; GT: FREE gift card"},null,null,null,{"$f":"IF(P2=\"\",\"\",IFERROR(INDIRECT(\"Postcodes!$C\"&SUMPRODUCT(--(Postcodes!$A$2:$A$100<=P2)*(Postcodes!$B$2:$B$100>=P2), ROW(Postcodes!$A$2:$A$100))),\"WRONG CODE\"))","v":0},null,null,null,null,null,null,{"$f":"IF(AND(X2=\"ASAP\",Y2=\"FREE gift card\",Z2=\"No Thanks\"),\"asap\",\"\")","v":""}]
[{"$f":"'Order Form'!A23","v":2},{"$f":"'Order Form'!M23","v":""},{"$f":"'Order Form'!$E$4","v":0},{"$f":"'Order Form'!$E$5","v":0},{"$f":"'Order Form'!$E$6","v":0},{"$f":"'Order Form'!$E$7","v":0},{"$f":"'Order Form'!$E$9","v":0},{"$f":"'Order Form'!$E$8","v":0},{"$f":"'Order Form'!$E$10","v":0},{"$f":"'Order Form'!$E$11","v":0},{"$f":"IF(('Order Form'!$E$15=\"YES\"),'Order Form'!$E$12,\"\")","v":0},{"$f":"'Order Form'!$E$13 & \"\"","v":""},{"$f":"IF('Order Form'!D23=\"\",'Order Form'!C23,'Order Form'!D23) & \"\"","v":""},{"$f":"'Order Form'!E23 & \"\"","v":""},{"$f":"'Order Form'!F23","v":0},{"$f":"'Order Form'!I23","v":0},{"$f":"'Order Form'!G23","v":0},{"$f":"'Order Form'!H23","v":0},{"$f":"'Order Form'!J23 & \"\"","v":""},{"$f":"'Order Form'!L23 & \"\"","v":""},{"$f":"'Order Form'!C23 & \"\"","v":""},{"$f":"'Order Form'!K23 & \"\"","v":""},{"$f":"'Order Form'!$E$14","v":"YES"},{"$f":"'Order Form'!$E$19","v":0},{"$f":"'Order Form'!$E$16","v":"FREE gift card"},{"$f":"'Order Form'!$E$17","v":"No thanks"},{"$f":"IF(OR(Y3=\"FREE gift card\",Y3=\"No Cards\"),\"No\",\"Yes\")","v":"No"},{"$f":"IF($Z$2=\"No thanks\",\"No\",\"Yes\")","v":"No"},{"$f":"\"Dispatch Week: \"&'Order Form'!$E$18","v":"Dispatch Week: "},{"$f":"\"VIP: \"&'Order Form'!$E$5 &\"; Rib: \"&'Order Form'!$E$17 &\"; GT: \"&'Order Form'!$E$16","v":"VIP: ; Rib: No thanks; GT: FREE gift card"},null,null,null,{"$f":"IF(P3=\"\",\"\",IFERROR(INDIRECT(\"Postcodes!$C\"&SUMPRODUCT(--(Postcodes!$A$2:$A$100<=P3)*(Postcodes!$B$2:$B$100>=P3), ROW(Postcodes!$A$2:$A$100))),\"WRONG CODE\"))","v":0},null,null,null,null,null,null,{"$f":"IF(AND(X3=\"ASAP\",Y3=\"FREE gift card\",Z3=\"No Thanks\"),\"asap\",\"\")","v":""}]
[{"$f":"'Order Form'!A24","v":3},{"$f":"'Order Form'!M24","v":""},{"$f":"'Order Form'!$E$4","v":0},{"$f":"'Order Form'!$E$5","v":0},{"$f":"'Order Form'!$E$6","v":0},{"$f":"'Order Form'!$E$7","v":0},{"$f":"'Order Form'!$E$9","v":0},{"$f":"'Order Form'!$E$8","v":0},{"$f":"'Order Form'!$E$10","v":0},{"$f":"'Order Form'!$E$11","v":0},{"$f":"IF(('Order Form'!$E$15=\"YES\"),'Order Form'!$E$12,\"\")","v":0},{"$f":"'Order Form'!$E$13 & \"\"","v":""},{"$f":"IF('Order Form'!D24=\"\",'Order Form'!C24,'Order Form'!D24) & \"\"","v":""},{"$f":"'Order Form'!E24 & \"\"","v":""},{"$f":"'Order Form'!F24","v":0},{"$f":"'Order Form'!I24","v":0},{"$f":"'Order Form'!G24","v":0},{"$f":"'Order Form'!H24","v":0},{"$f":"'Order Form'!J24 & \"\"","v":""},{"$f":"'Order Form'!L24 & \"\"","v":""},{"$f":"'Order Form'!C24 & \"\"","v":""},{"$f":"'Order Form'!K24 & \"\"","v":""},{"$f":"'Order Form'!$E$14","v":"YES"},{"$f":"'Order Form'!$E$19","v":0},{"$f":"'Order Form'!$E$16","v":"FREE gift card"},{"$f":"'Order Form'!$E$17","v":"No thanks"},"No","No",{"$f":"\"Dispatch Week: \"&'Order Form'!$E$18","v":"Dispatch Week: "},{"$f":"\"VIP: \"&'Order Form'!$E$5 &\"; Rib: \"&'Order Form'!$E$17 &\"; GT: \"&'Order Form'!$E$16","v":"VIP: ; Rib: No thanks; GT: FREE gift card"},null,null,null,{"$f":"IF(P4=\"\",\"\",IFERROR(INDIRECT(\"Postcodes!$C\"&SUMPRODUCT(--(Postcodes!$A$2:$A$100<=P4)*(Postcodes!$B$2:$B$100>=P4), ROW(Postcodes!$A$2:$A$100))),\"WRONG CODE\"))","v":0},null,null,null,null,null,null,""]
[{"$f":"'Order Form'!A25","v":4},{"$f":"'Order Form'!M25","v":""},{"$f":"'Order Form'!$E$4","v":0},{"$f":"'Order Form'!$E$5","v":0},{"$f":"'Order Form'!$E$6","v":0},{"$f":"'Order Form'!$E$7","v":0},{"$f":"'Order Form'!$E$9","v":0},{"$f":"'Order Form'!$E$8","v":0},{"$f":"'Order Form'!$E$10","v":0},{"$f":"'Order Form'!$E$11","v":0},{"$f":"IF(('Order Form'!$E$15=\"YES\"),'Order Form'!$E$12,\"\")","v":0},{"$f":"'Order Form'!$E$13 & \"\"","v":""},{"$f":"IF('Order Form'!D25=\"\",'Order Form'!C25,'Order Form'!D25) & \"\"","v":""},{"$f":"'Order Form'!E25 & \"\"","v":""},{"$f":"'Order Form'!F25","v":0},{"$f":"'Order Form'!I25","v":0},{"$f":"'Order Form'!G25","v":0},{"$f":"'Order Form'!H25","v":0},{"$f":"'Order Form'!J25 & \"\"","v":""},{"$f":"'Order Form'!L25 & \"\"","v":""},{"$f":"'Order Form'!C25 & \"\"","v":""},{"$f":"'Order Form'!K25 & \"\"","v":""},{"$f":"'Order Form'!$E$14","v":"YES"},{"$f":"'Order Form'!$E$19","v":0},{"$f":"'Order Form'!$E$16","v":"FREE gift card"},{"$f":"'Order Form'!$E$17","v":"No thanks"},"No","No",{"$f":"\"Dispatch Week: \"&'Order Form'!$E$18","v":"Dispatch Week: "},{"$f":"\"VIP: \"&'Order Form'!$E$5 &\"; Rib: \"&'Order Form'!$E$17 &\"; GT: \"&'Order Form'!$E$16","v":"VIP: ; Rib: No thanks; GT: FREE gift card"},null,null,null,{"$f":"IF(P5=\"\",\"\",IFERROR(INDIRECT(\"Postcodes!$C\"&SUMPRODUCT(--(Postcodes!$A$2:$A$100<=P5)*(Postcodes!$B$2:$B$100>=P5), ROW(Postcodes!$A$2:$A$100))),\"WRONG CODE\"))","v":0},null,null,null,null,null,null,""]
[{"$f":"'Order Form'!A26","v":5},{"$f":"'Order Form'!M26","v":""},{"$f":"'Order Form'!$E$4","v":0},{"$f":"'Order Form'!$E$5","v":0},{"$f":"'Order Form'!$E$6","v":0},{"$f":"'Order Form'!$E$7","v":0},{"$f":"'Order Form'!$E$9","v":0},{"$f":"'Order Form'!$E$8","v":0},{"$f":"'Order Form'!$E$10","v":0},{"$f":"'Order Form'!$E$11","v":0},{"$f":"IF(('Order Form'!$E$15=\"YES\"),'Order Form'!$E$12,\"\")","v":0},{"$f":"'Order Form'!$E$13 & \"\"","v":""},{"$f":"IF('Order Form'!D26=\"\",'Order Form'!C26,'Order Form'!D26) & \"\"","v":""},{"$f":"'Order Form'!E26 & \"\"","v":""},{"$f":"'Order Form'!F26","v":0},{"$f":"'Order Form'!I26","v":0},{"$f":"'Order Form'!G26","v":0},{"$f":"'Order Form'!H26","v":0},{"$f":"'Order Form'!J26 & \"\"","v":""},{"$f":"'Order Form'!L26 & \"\"","v":""},{"$f":"'Order Form'!C26 & \"\"","v":""},{"$f":"'Order Form'!K26 & \"\"","v":""},{"$f":"'Order Form'!$E$14","v":"YES"},{"$f":"'Order Form'!$E$19","v":0},{"$f":"'Order Form'!$E$16","v":"FREE gift card"},{"$f":"'Order Form'!$E$17","v":"No thanks"},"No","No",{"$f":"\"Dispatch Week: \"&'Order Form'!$E$18","v":"Dispatch Week: "},{"$f":"\"VIP: \"&'Order Form'!$E$5 &\"; Rib: \"&'Order Form'!$E$17 &\"; GT: \"&'Order Form'!$E$16","v":"VIP: ; Rib: No thanks; GT: FREE gift card"},null,null,null,{"$f":"IF(P6=\"\",\"\",IFERROR(INDIRECT(\"Postcodes!$C\"&SUMPRODUCT(--(Postcodes!$A$2:$A$100<=P6)*(Postcodes!$B$2:$B$100>=P6), ROW(Postcodes!$A$2:$A$100))),\"WRONG CODE\"))","v":0},null,null,null,null,null,null,""]
[{"$f":"'Order Form'!A27","v":6},{"$f":"'Order Form'!M27","v":""},{"$f":"'Order Form'!$E$4","v":0},{"$f":"'Order Form'!$E$5","v":0},{"$f":"'Order Form'!$E$6","v":0},{"$f":"'Order Form'!$E$7","v":0},{"$f":"'Order Form'!$E$9","v":0},{"$f":"'Order Form'!$E$8","v":0},{"$f":"'Order Form'!$E$10","v":0},{"$f":"'Order Form'!$E$11","v":0},{"$f":"IF(('Order Form'!$E$15=\"YES\"),'Order Form'!$E$12,\"\")","v":0},{"$f":"'Order Form'!$E$13 & \"\"","v":""},{"$f":"IF('Order Form'!D27=\"\",'Order Form'!C27,'Order Form'!D27) & \"\"","v":""},{"$f":"'Order Form'!E27 & \"\"","v":""},{"$f":"'Order Form'!F27","v":0},{"$f":"'Order Form'!I27","v":0},{"$f":"'Order Form'!G27","v":0},{"$f":"'Order Form'!H27","v":0},{"$f":"'Order Form'!J27 & \"\"","v":""},{"$f":"'Order Form'!L27 & \"\"","v":""},{"$f":"'Order Form'!C27 & \"\"","v":""},{"$f":"'Order Form'!K27 & \"\"","v":""},{"$f":"'Order Form'!$E$14","v":"YES"},{"$f":"'Order Form'!$E$19","v":0},{"$f":"'Order Form'!$E$16","v":"FREE gift card"},{"$f":"'Order Form'!$E$17","v":"No thanks"},"No","No",{"$f":"\"Dispatch Week: \"&'Order Form'!$E$18","v":"Dispatch Week: "},{"$f":"\"VIP: \"&'Order Form'!$E$5 &\"; Rib: \"&'Order Form'!$E$17 &\"; GT: \"&'Order Form'!$E$16","v":"VIP: ; Rib: No thanks; GT: FREE gift card"},null,null,null,{"$f":"IF(P7=\"\",\"\",IFERROR(INDIRECT(\"Postcodes!$C\"&SUMPRODUCT(--(Postcodes!$A$2:$A$100<=P7)*(Postcodes!$B$2:$B$100>=P7), ROW(Postcodes!$A$2:$A$100))),\"WRONG CODE\"))","v":0},null,null,null,null,null,null,""]
[{"$f":"'Order Form'!A28","v":7},{"$f":"'Order Form'!M28","v":""},{"$f":"'Order Form'!$E$4","v":0},{"$f":"'Order Form'!$E$5","v":0},{"$f":"'Order Form'!$E$6","v":0},{"$f":"'Order Form'!$E$7","v":0},{"$f":"'Order Form'!$E$9","v":0},{"$f":"'Order Form'!$E$8","v":0},{"$f":"'Order Form'!$E$10","v":0},{"$f":"'Order Form'!$E$11","v":0},{"$f":"IF(('Order Form'!$E$15=\"YES\"),'Order Form'!$E$12,\"\")","v":0},{"$f":"'Order Form'!$E$13 & \"\"","v":""},{"$f":"IF('Order Form'!D28=\"\",'Order Form'!C28,'Order Form'!D28) & \"\"","v":""},{"$f":"'Order Form'!E28 & \"\"","v":""},{"$f":"'Order Form'!F28","v":0},{"$f":"'Order Form'!I28","v":0},{"$f":"'Order Form'!G28","v":0},{"$f":"'Order Form'!H28","v":0},{"$f":"'Order Form'!J28 & \"\"","v":""},{"$f":"'Order Form'!L28 & \"\"","v":""},{"$f":"'Order Form'!C28 & \"\"","v":""},{"$f":"'Order Form'!K28 & \"\"","v":""},{"$f":"'Order Form'!$E$14","v":"YES"},{"$f":"'Order Form'!$E$19","v":0},{"$f":"'Order Form'!$E$16","v":"FREE gift card"},{"$f":"'Order Form'!$E$17","v":"No thanks"},"No","No",{"$f":"\"Dispatch Week: \"&'Order Form'!$E$18","v":"Dispatch Week: "},{"$f":"\"VIP: \"&'Order Form'!$E$5 &\"; Rib: \"&'Order Form'!$E$17 &\"; GT: \"&'Order Form'!$E$16","v":"VIP: ; Rib: No thanks; GT: FREE gift card"},null,null,null,{"$f":"IF(P8=\"\",\"\",IFERROR(INDIRECT(\"Postcodes!$C\"&SUMPRODUCT(--(Postcodes!$A$2:$A$100<=P8)*(Postcodes!$B$2:$B$100>=P8), ROW(Postcodes!$A$2:$A$100))),\"WRONG CODE\"))","v":0},null,null,null,null,null,null,""]
[{"$f":"'Order Form'!A29","v":8},{"$f":"'Order Form'!M29","v":""},{"$f":"'Order Form'!$E$4","v":0},{"$f":"'Order Form'!$E$5","v":0},{"$f":"'Order Form'!$E$6","v":0},{"$f":"'Order Form'!$E$7","v":0},{"$f":"'Order Form'!$E$9","v":0},{"$f":"'Order Form'!$E$8","v":0},{"$f":"'Order Form'!$E$10","v":0},{"$f":"'Order Form'!$E$11","v":0},{"$f":"IF(('Order Form'!$E$15=\"YES\"),'Order Form'!$E$12,\"\")","v":0},{"$f":"'Order Form'!$E$13 & \"\"","v":""},{"$f":"IF('Order Form'!D29=\"\",'Order Form'!C29,'Order Form'!D29) & \"\"","v":""},{"$f":"'Order Form'!E29 & \"\"","v":""},{"$f":"'Order Form'!F29","v":0},{"$f":"'Order Form'!I29","v":0},{"$f":"'Order Form'!G29","v":0},{"$f":"'Order Form'!H29","v":0},{"$f":"'Order Form'!J29 & \"\"","v":""},{"$f":"'Order Form'!L29 & \"\"","v":""},{"$f":"'Order Form'!C29 & \"\"","v":""},{"$f":"'Order Form'!K29 & \"\"","v":""},{"$f":"'Order Form'!$E$14","v":"YES"},{"$f":"'Order Form'!$E$19","v":0},{"$f":"'Order Form'!$E$16","v":"FREE gift card"},{"$f":"'Order Form'!$E$17","v":"No thanks"},"No","No",{"$f":"\"Dispatch Week: \"&'Order Form'!$E$18","v":"Dispatch Week: "},{"$f":"\"VIP: \"&'Order Form'!$E$5 &\"; Rib: \"&'Order Form'!$E$17 &\"; GT: \"&'Order Form'!$E$16","v":"VIP: ; Rib: No thanks; GT: FREE gift card"},null,null,null,{"$f":"IF(P9=\"\",\"\",IFERROR(INDIRECT(\"Postcodes!$C\"&SUMPRODUCT(--(Postcodes!$A$2:$A$100<=P9)*(Postcodes!$B$2:$B$100>=P9), ROW(Postcodes!$A$2:$A$100))),\"WRONG CODE\"))","v":0},null,null,null,null,null,null,""]
[{"$f":"'Order Form'!A30","v":9},{"$f":"'Order Form'!M30","v":""},{"$f":"'Order Form'!$E$4","v":0},{"$f":"'Order Form'!$E$5","v":0},{"$f":"'Order Form'!$E$6","v":0},{"$f":"'Order Form'!$E$7","v":0},{"$f":"'Order Form'!$E$9","v":0},{"$f":"'Order Form'!$E$8","v":0},{"$f":"'Order Form'!$E$10","v":0},{"$f":"'Order Form'!$E$11","v":0},{"$f":"IF(('Order Form'!$E$15=\"YES\"),'Order Form'!$E$12,\"\")","v":0},{"$f":"'Order Form'!$E$13 & \"\"","v":""},{"$f":"IF('Order Form'!D30=\"\",'Order Form'!C30,'Order Form'!D30) & \"\"","v":""},{"$f":"'Order Form'!E30 & \"\"","v":""},{"$f":"'Order Form'!F30","v":0},{"$f":"'Order Form'!I30","v":0},{"$f":"'Order Form'!G30","v":0},{"$f":"'Order Form'!H30","v":0},{"$f":"'Order Form'!J30 & \"\"","v":""},{"$f":"'Order Form'!L30 & \"\"","v":""},{"$f":"'Order Form'!C30 & \"\"","v":""},{"$f":"'Order Form'!K30 & \"\"","v":""},{"$f":"'Order Form'!$E$14","v":"YES"},{"$f":"'Order Form'!$E$19","v":0},{"$f":"'Order Form'!$E$16","v":"FREE gift card"},{"$f":"'Order Form'!$E$17","v":"No thanks"},"No","No",{"$f":"\"Dispatch Week: \"&'Order Form'!$E$18","v":"Dispatch Week: "},{"$f":"\"VIP: \"&'Order Form'!$E$5 &\"; Rib: \"&'Order Form'!$E$17 &\"; GT: \"&'Order Form'!$E$16","v":"VIP: ; Rib: No thanks; GT: FREE gift card"},null,null,null,{"$f":"IF(P10=\"\",\"\",IFERROR(INDIRECT(\"Postcodes!$C\"&SUMPRODUCT(--(Postcodes!$A$2:$A$100<=P10)*(Postcodes!$B$2:$B$100>=P10), ROW(Postcodes!$A$2:$A$100))),\"WRONG CODE\"))","v":0},null,null,null,null,null,null,""]
[{"$f":"'Order Form'!A31","v":10},{"$f":"'Order Form'!M31","v":""},{"$f":"'Order Form'!$E$4","v":0},{"$f":"'Order Form'!$E$5","v":0},{"$f":"'Order Form'!$E$6","v":0},{"$f":"'Order Form'!$E$7","v":0},{"$f":"'Order Form'!$E$9","v":0},{"$f":"'Order Form'!$E$8","v":0},{"$f":"'Order Form'!$E$10","v":0},{"$f":"'Order Form'!$E$11","v":0},{"$f":"IF(('Order Form'!$E$15=\"YES\"),'Order Form'!$E$12,\"\")","v":0},{"$f":"'Order Form'!$E$13 & \"\"","v":""},{"$f":"IF('Order Form'!D31=\"\",'Order Form'!C31,'Order Form'!D31) & \"\"","v":""},{"$f":"'Order Form'!E31 & \"\"","v":""},{"$f":"'Order Form'!F31","v":0},{"$f":"'Order Form'!I31","v":0},{"$f":"'Order Form'!G31","v":0},{"$f":"'Order Form'!H31","v":0},{"$f":"'Order Form'!J31 & \"\"","v":""},{"$f":"'Order Form'!L31 & \"\"","v":""},{"$f":"'Order Form'!C31 & \"\"","v":""},{"$f":"'Order Form'!K31 & \"\"","v":""},{"$f":"'Order Form'!$E$14","v":"YES"},{"$f":"'Order Form'!$E$19","v":0},{"$f":"'Order Form'!$E$16","v":"FREE gift card"},{"$f":"'Order Form'!$E$17","v":"No thanks"},"No","No",{"$f":"\"Dispatch Week: \"&'Order Form'!$E$18","v":"Dispatch Week: "},{"$f":"\"VIP: \"&'Order Form'!$E$5 &\"; Rib: \"&'Order Form'!$E$17 &\"; GT: \"&'Order Form'!$E$16","v":"VIP: ; Rib: No thanks; GT: FREE gift card"},null,null,null,{"$f":"IF(P11=\"\",\"\",IFERROR(INDIRECT(\"Postcodes!$C\"&SUMPRODUCT(--(Postcodes!$A$2:$A$100<=P11)*(Postcodes!$B$2:$B$100>=P11), ROW(Postcodes!$A$2:$A$100))),\"WRONG CODE\"))","v":0},null,null,null,null,null,null,""]
[{"$f":"'Order Form'!A32","v":11},{"$f":"'Order Form'!M32","v":""},{"$f":"'Order Form'!$E$4","v":0},{"$f":"'Order Form'!$E$5","v":0},{"$f":"'Order Form'!$E$6","v":0},{"$f":"'Order Form'!$E$7","v":0},{"$f":"'Order Form'!$E$9","v":0},{"$f":"'Order Form'!$E$8","v":0},{"$f":"'Order Form'!$E$10","v":0},{"$f":"'Order Form'!$E$11","v":0},{"$f":"IF(('Order Form'!$E$15=\"YES\"),'Order Form'!$E$12,\"\")","v":0},{"$f":"'Order Form'!$E$13 & \"\"","v":""},{"$f":"IF('Order Form'!D32=\"\",'Order Form'!C32,'Order Form'!D32) & \"\"","v":""},{"$f":"'Order Form'!E32 & \"\"","v":""},{"$f":"'Order Form'!F32","v":0},{"$f":"'Order Form'!I32","v":0},{"$f":"'Order Form'!G32","v":0},{"$f":"'Order Form'!H32","v":0},{"$f":"'Order Form'!J32 & \"\"","v":""},{"$f":"'Order Form'!L32 & \"\"","v":""},{"$f":"'Order Form'!C32 & \"\"","v":""},{"$f":"'Order Form'!K32 & \"\"","v":""},{"$f":"'Order Form'!$E$14","v":"YES"},{"$f":"'Order Form'!$E$19","v":0},{"$f":"'Order Form'!$E$16","v":"FREE gift card"},{"$f":"'Order Form'!$E$17","v":"No thanks"},"No","No",{"$f":"\"Dispatch Week: \"&'Order Form'!$E$18","v":"Dispatch Week: "},{"$f":"\"VIP: \"&'Order Form'!$E$5 &\"; Rib: \"&'Order Form'!$E$17 &\"; GT: \"&'Order Form'!$E$16","v":"VIP: ; Rib: No thanks; GT: FREE gift card"},null,null,null,{"$f":"IF(P12=\"\",\"\",IFERROR(INDIRECT(\"Postcodes!$C\"&SUMPRODUCT(--(Postcodes!$A$2:$A$100<=P12)*(Postcodes!$B$2:$B$100>=P12), ROW(Postcodes!$A$2:$A$100))),\"WRONG CODE\"))","v":0},null,null,null,null,null,null,""]
[{"$f":"'Order Form'!A33","v":12},{"$f":"'Order Form'!M33","v":""},{"$f":"'Order Form'!$E$4","v":0},{"$f":"'Order Form'!$E$5","v":0},{"$f":"'Order Form'!$E$6","v":0},{"$f":"'Order Form'!$E$7","v":0},{"$f":"'Order Form'!$E$9","v":0},{"$f":"'Order Form'!$E$8","v":0},{"$f":"'Order Form'!$E$10","v":0},{"$f":"'Order Form'!$E$11","v":0},{"$f":"IF(('Order Form'!$E$15=\"YES\"),'Order Form'!$E$12,\"\")","v":0},{"$f":"'Order Form'!$E$13 & \"\"","v":""},{"$f":"IF('Order Form'!D33=\"\",'Order Form'!C33,'Order Form'!D33) & \"\"","v":""},{"$f":"'Order Form'!E33 & \"\"","v":""},{"$f":"'Order Form'!F33","v":0},{"$f":"'Order Form'!I33","v":0},{"$f":"'Order Form'!G33","v":0},{"$f":"'Order Form'!H33","v":0},{"$f":"'Order Form'!J33 & \"\"","v":""},{"$f":"'Order Form'!L33 & \"\"","v":""},{"$f":"'Order Form'!C33 & \"\"","v":""},{"$f":"'Order Form'!K33 & \"\"","v":""},{"$f":"'Order Form'!$E$14","v":"YES"},{"$f":"'Order Form'!$E$19","v":0},{"$f":"'Order Form'!$E$16","v":"FREE gift card"},{"$f":"'Order Form'!$E$17","v":"No thanks"},"No","No",{"$f":"\"Dispatch Week: \"&'Order Form'!$E$18","v":"Dispatch Week: "},{"$f":"\"VIP: \"&'Order Form'!$E$5 &\"; Rib: \"&'Order Form'!$E$17 &\"; GT: \"&'Order Form'!$E$16","v":"VIP: ; Rib: No thanks; GT: FREE gift card"},null,null,null,{"$f":"IF(P13=\"\",\"\",IFERROR(INDIRECT(\"Postcodes!$C\"&SUMPRODUCT(--(Postcodes!$A$2:$A$100<=P13)*(Postcodes!$B$2:$B$100>=P13), ROW(Postcodes!$A$2:$A$100))),\"WRONG CODE\"))","v":0},null,null,null,null,null,null,""]
[{"$f":"'Order Form'!A34","v":13},{"$f":"'Order Form'!M34","v":""},{"$f":"'Order Form'!$E$4","v":0},{"$f":"'Order Form'!$E$5","v":0},{"$f":"'Order Form'!$E$6","v":0},{"$f":"'Order Form'!$E$7","v":0},{"$f":"'Order Form'!$E$9","v":0},{"$f":"'Order Form'!$E$8","v":0},{"$f":"'Order Form'!$E$10","v":0},{"$f":"'Order Form'!$E$11","v":0},{"$f":"IF(('Order Form'!$E$15=\"YES\"),'Order Form'!$E$12,\"\")","v":0},{"$f":"'Order Form'!$E$13 & \"\"","v":""},{"$f":"IF('Order Form'!D34=\"\",'Order Form'!C34,'Order Form'!D34) & \"\"","v":""},{"$f":"'Order Form'!E34 & \"\"","v":""},{"$f":"'Order Form'!F34","v":0},{"$f":"'Order Form'!I34","v":0},{"$f":"'Order Form'!G34","v":0},{"$f":"'Order Form'!H34","v":0},{"$f":"'Order Form'!J34 & \"\"","v":""},{"$f":"'Order Form'!L34 & \"\"","v":""},{"$f":"'Order Form'!C34 & \"\"","v":""},{"$f":"'Order Form'!K34 & \"\"","v":""},{"$f":"'Order Form'!$E$14","v":"YES"},{"$f":"'Order Form'!$E$19","v":0},{"$f":"'Order Form'!$E$16","v":"FREE gift card"},{"$f":"'Order Form'!$E$17","v":"No thanks"},"No","No",{"$f":"\"Dispatch Week: \"&'Order Form'!$E$18","v":"Dispatch Week: "},{"$f":"\"VIP: \"&'Order Form'!$E$5 &\"; Rib: \"&'Order Form'!$E$17 &\"; GT: \"&'Order Form'!$E$16","v":"VIP: ; Rib: No thanks; GT: FREE gift card"},null,null,null,{"$f":"IF(P14=\"\",\"\",IFERROR(INDIRECT(\"Postcodes!$C\"&SUMPRODUCT(--(Postcodes!$A$2:$A$100<=P14)*(Postcodes!$B$2:$B$100>=P14), ROW(Postcodes!$A$2:$A$100))),\"WRONG CODE\"))","v":0},null,null,null,null,null,null,""]
[{"$f":"'Order Form'!A35","v":14},{"$f":"'Order Form'!M35","v":""},{"$f":"'Order Form'!$E$4","v":0},{"$f":"'Order Form'!$E$5","v":0},{"$f":"'Order Form'!$E$6","v":0},{"$f":"'Order Form'!$E$7","v":0},{"$f":"'Order Form'!$E$9","v":0},{"$f":"'Order Form'!$E$8","v":0},{"$f":"'Order Form'!$E$10","v":0},{"$f":"'Order Form'!$E$11","v":0},{"$f":"IF(('Order Form'!$E$15=\"YES\"),'Order Form'!$E$12,\"\")","v":0},{"$f":"'Order Form'!$E$13 & \"\"","v":""},{"$f":"IF('Order Form'!D35=\"\",'Order Form'!C35,'Order Form'!D35) & \"\"","v":""},{"$f":"'Order Form'!E35 & \"\"","v":""},{"$f":"'Order Form'!F35","v":0},{"$f":"'Order Form'!I35","v":0},{"$f":"'Order Form'!G35","v":0},{"$f":"'Order Form'!H35","v":0},{"$f":"'Order Form'!J35 & \"\"","v":""},{"$f":"'Order Form'!L35 & \"\"","v":""},{"$f":"'Order Form'!C35 & \"\"","v":""},{"$f":"'Order Form'!K35 & \"\"","v":""},{"$f":"'Order Form'!$E$14","v":"YES"},{"$f":"'Order Form'!$E$19","v":0},{"$f":"'Order Form'!$E$16","v":"FREE gift card"},{"$f":"'Order Form'!$E$17","v":"No thanks"},"No","No",{"$f":"\"Dispatch Week: \"&'Order Form'!$E$18","v":"Dispatch Week: "},{"$f":"\"VIP: \"&'Order Form'!$E$5 &\"; Rib: \"&'Order Form'!$E$17 &\"; GT: \"&'Order Form'!$E$16","v":"VIP: ; Rib: No thanks; GT: FREE gift card"},null,null,null,{"$f":"IF(P15=\"\",\"\",IFERROR(INDIRECT(\"Postcodes!$C\"&SUMPRODUCT(--(Postcodes!$A$2:$A$100<=P15)*(Postcodes!$B$2:$B$100>=P15), ROW(Postcodes!$A$2:$A$100))),\"WRONG CODE\"))","v":0},null,null,null,null,null,null,""]
[{"$f":"'Order Form'!A36","v":15},{"$f":"'Order Form'!M36","v":""},{"$f":"'Order Form'!$E$4","v":0},{"$f":"'Order Form'!$E$5","v":0},{"$f":"'Order Form'!$E$6","v":0},{"$f":"'Order Form'!$E$7","v":0},{"$f":"'Order Form'!$E$9","v":0},{"$f":"'Order Form'!$E$8","v":0},{"$f":"'Order Form'!$E$10","v":0},{"$f":"'Order Form'!$E$11","v":0},{"$f":"IF(('Order Form'!$E$15=\"YES\"),'Order Form'!$E$12,\"\")","v":0},{"$f":"'Order Form'!$E$13 & \"\"","v":""},{"$f":"IF('Order Form'!D36=\"\",'Order Form'!C36,'Order Form'!D36) & \"\"","v":""},{"$f":"'Order Form'!E36 & \"\"","v":""},{"$f":"'Order Form'!F36","v":0},{"$f":"'Order Form'!I36","v":0},{"$f":"'Order Form'!G36","v":0},{"$f":"'Order Form'!H36","v":0},{"$f":"'Order Form'!J36 & \"\"","v":""},{"$f":"'Order Form'!L36 & \"\"","v":""},{"$f":"'Order Form'!C36 & \"\"","v":""},{"$f":"'Order Form'!K36 & \"\"","v":""},{"$f":"'Order Form'!$E$14","v":"YES"},{"$f":"'Order Form'!$E$19","v":0},{"$f":"'Order Form'!$E$16","v":"FREE gift card"},{"$f":"'Order Form'!$E$17","v":"No thanks"},"No","No",{"$f":"\"Dispatch Week: \"&'Order Form'!$E$18","v":"Dispatch Week: "},{"$f":"\"VIP: \"&'Order Form'!$E$5 &\"; Rib: \"&'Order Form'!$E$17 &\"; GT: \"&'Order Form'!$E$16","v":"VIP: ; Rib: No thanks; GT: FREE gift card"},null,null,null,{"$f":"IF(P16=\"\",\"\",IFERROR(INDIRECT(\"Postcodes!$C\"&SUMPRODUCT(--(Postcodes!$A$2:$A$100<=P16)*(Postcodes!$B$2:$B$100>=P16), ROW(Postcodes!$A$2:$A$100))),\"WRONG CODE\"))","v":0},null,null,null,null,null,null,""]
[{"$f":"'Order Form'!A37","v":16},{"$f":"'Order Form'!M37","v":""},{"$f":"'Order Form'!$E$4","v":0},{"$f":"'Order Form'!$E$5","v":0},{"$f":"'Order Form'!$E$6","v":0},{"$f":"'Order Form'!$E$7","v":0},{"$f":"'Order Form'!$E$9","v":0},{"$f":"'Order Form'!$E$8","v":0},{"$f":"'Order Form'!$E$10","v":0},{"$f":"'Order Form'!$E$11","v":0},{"$f":"IF(('Order Form'!$E$15=\"YES\"),'Order Form'!$E$12,\"\")","v":0},{"$f":"'Order Form'!$E$13 & \"\"","v":""},{"$f":"IF('Order Form'!D37=\"\",'Order Form'!C37,'Order Form'!D37) & \"\"","v":""},{"$f":"'Order Form'!E37 & \"\"","v":""},{"$f":"'Order Form'!F37","v":0},{"$f":"'Order Form'!I37","v":0},{"$f":"'Order Form'!G37","v":0},{"$f":"'Order Form'!H37","v":0},{"$f":"'Order Form'!J37 & \"\"","v":""},{"$f":"'Order Form'!L37 & \"\"","v":""},{"$f":"'Order Form'!C37 & \"\"","v":""},{"$f":"'Order Form'!K37 & \"\"","v":""},{"$f":"'Order Form'!$E$14","v":"YES"},{"$f":"'Order Form'!$E$19","v":0},{"$f":"'Order Form'!$E$16","v":"FREE gift card"},{"$f":"'Order Form'!$E$17","v":"No thanks"},"No","No",{"$f":"\"Dispatch Week: \"&'Order Form'!$E$18","v":"Dispatch Week: "},{"$f":"\"VIP: \"&'Order Form'!$E$5 &\"; Rib: \"&'Order Form'!$E$17 &\"; GT: \"&'Order Form'!$E$16","v":"VIP: ; Rib: No thanks; GT: FREE gift card"},null,null,null,{"$f":"IF(P17=\"\",\"\",IFERROR(INDIRECT(\"Postcodes!$C\"&SUMPRODUCT(--(Postcodes!$A$2:$A$100<=P17)*(Postcodes!$B$2:$B$100>=P17), ROW(Postcodes!$A$2:$A$100))),\"WRONG CODE\"))","v":0},null,null,null,null,null,null,""]
[{"$f":"'Order Form'!A38","v":17},{"$f":"'Order Form'!M38","v":""},{"$f":"'Order Form'!$E$4","v":0},{"$f":"'Order Form'!$E$5","v":0},{"$f":"'Order Form'!$E$6","v":0},{"$f":"'Order Form'!$E$7","v":0},{"$f":"'Order Form'!$E$9","v":0},{"$f":"'Order Form'!$E$8","v":0},{"$f":"'Order Form'!$E$10","v":0},{"$f":"'Order Form'!$E$11","v":0},{"$f":"IF(('Order Form'!$E$15=\"YES\"),'Order Form'!$E$12,\"\")","v":0},{"$f":"'Order Form'!$E$13 & \"\"","v":""},{"$f":"IF('Order Form'!D38=\"\",'Order Form'!C38,'Order Form'!D38) & \"\"","v":""},{"$f":"'Order Form'!E38 & \"\"","v":""},{"$f":"'Order Form'!F38","v":0},{"$f":"'Order Form'!I38","v":0},{"$f":"'Order Form'!G38","v":0},{"$f":"'Order Form'!H38","v":0},{"$f":"'Order Form'!J38 & \"\"","v":""},{"$f":"'Order Form'!L38 & \"\"","v":""},{"$f":"'Order Form'!C38 & \"\"","v":""},{"$f":"'Order Form'!K38 & \"\"","v":""},{"$f":"'Order Form'!$E$14","v":"YES"},{"$f":"'Order Form'!$E$19","v":0},{"$f":"'Order Form'!$E$16","v":"FREE gift card"},{"$f":"'Order Form'!$E$17","v":"No thanks"},"No","No",{"$f":"\"Dispatch Week: \"&'Order Form'!$E$18","v":"Dispatch Week: "},{"$f":"\"VIP: \"&'Order Form'!$E$5 &\"; Rib: \"&'Order Form'!$E$17 &\"; GT: \"&'Order Form'!$E$16","v":"VIP: ; Rib: No thanks; GT: FREE gift card"},null,null,null,{"$f":"IF(P18=\"\",\"\",IFERROR(INDIRECT(\"Postcodes!$C\"&SUMPRODUCT(--(Postcodes!$A$2:$A$100<=P18)*(Postcodes!$B$2:$B$100>=P18), ROW(Postcodes!$A$2:$A$100))),\"WRONG CODE\"))","v":0},null,null,null,null,null,null,""]
[{"$f":"'Order Form'!A39","v":18},{"$f":"'Order Form'!M39","v":""},{"$f":"'Order Form'!$E$4","v":0},{"$f":"'Order Form'!$E$5","v":0},{"$f":"'Order Form'!$E$6","v":0},{"$f":"'Order Form'!$E$7","v":0},{"$f":"'Order Form'!$E$9","v":0},{"$f":"'Order Form'!$E$8","v":0},{"$f":"'Order Form'!$E$10","v":0},{"$f":"'Order Form'!$E$11","v":0},{"$f":"IF(('Order Form'!$E$15=\"YES\"),'Order Form'!$E$12,\"\")","v":0},{"$f":"'Order Form'!$E$13 & \"\"","v":""},{"$f":"IF('Order Form'!D39=\"\",'Order Form'!C39,'Order Form'!D39) & \"\"","v":""},{"$f":"'Order Form'!E39 & \"\"","v":""},{"$f":"'Order Form'!F39","v":0},{"$f":"'Order Form'!I39","v":0},{"$f":"'Order Form'!G39","v":0},{"$f":"'Order Form'!H39","v":0},{"$f":"'Order Form'!J39 & \"\"","v":""},{"$f":"'Order Form'!L39 & \"\"","v":""},{"$f":"'Order Form'!C39 & \"\"","v":""},{"$f":"'Order Form'!K39 & \"\"","v":""},{"$f":"'Order Form'!$E$14","v":"YES"},{"$f":"'Order Form'!$E$19","v":0},{"$f":"'Order Form'!$E$16","v":"FREE gift card"},{"$f":"'Order Form'!$E$17","v":"No thanks"},"No","No",{"$f":"\"Dispatch Week: \"&'Order Form'!$E$18","v":"Dispatch Week: "},{"$f":"\"VIP: \"&'Order Form'!$E$5 &\"; Rib: \"&'Order Form'!$E$17 &\"; GT: \"&'Order Form'!$E$16","v":"VIP: ; Rib: No thanks; GT: FREE gift card"},null,null,null,{"$f":"IF(P19=\"\",\"\",IFERROR(INDIRECT(\"Postcodes!$C\"&SUMPRODUCT(--(Postcodes!$A$2:$A$100<=P19)*(Postcodes!$B$2:$B$100>=P19), ROW(Postcodes!$A$2:$A$100))),\"WRONG CODE\"))","v":0},null,null,null,null,null,null,""]
[{"$f":"'Order Form'!A40","v":19},{"$f":"'Order Form'!M40","v":""},{"$f":"'Order Form'!$E$4","v":0},{"$f":"'Order Form'!$E$5","v":0},{"$f":"'Order Form'!$E$6","v":0},{"$f":"'Order Form'!$E$7","v":0},{"$f":"'Order Form'!$E$9","v":0},{"$f":"'Order Form'!$E$8","v":0},{"$f":"'Order Form'!$E$10","v":0},{"$f":"'Order Form'!$E$11","v":0},{"$f":"IF(('Order Form'!$E$15=\"YES\"),'Order Form'!$E$12,\"\")","v":0},{"$f":"'Order Form'!$E$13 & \"\"","v":""},{"$f":"IF('Order Form'!D40=\"\",'Order Form'!C40,'Order Form'!D40) & \"\"","v":""},{"$f":"'Order Form'!E40 & \"\"","v":""},{"$f":"'Order Form'!F40","v":0},{"$f":"'Order Form'!I40","v":0},{"$f":"'Order Form'!G40","v":0},{"$f":"'Order Form'!H40","v":0},{"$f":"'Order Form'!J40 & \"\"","v":""},{"$f":"'Order Form'!L40 & \"\"","v":""},{"$f":"'Order Form'!C40 & \"\"","v":""},{"$f":"'Order Form'!K40 & \"\"","v":""},{"$f":"'Order Form'!$E$14","v":"YES"},{"$f":"'Order Form'!$E$19","v":0},{"$f":"'Order Form'!$E$16","v":"FREE gift card"},{"$f":"'Order Form'!$E$17","v":"No thanks"},"No","No",{"$f":"\"Dispatch Week: \"&'Order Form'!$E$18","v":"Dispatch Week: "},{"$f":"\"VIP: \"&'Order Form'!$E$5 &\"; Rib: \"&'Order Form'!$E$17 &\"; GT: \"&'Order Form'!$E$16","v":"VIP: ; Rib: No thanks; GT: FREE gift card"},null,null,null,{"$f":"IF(P20=\"\",\"\",IFERROR(INDIRECT(\"Postcodes!$C\"&SUMPRODUCT(--(Postcodes!$A$2:$A$100<=P20)*(Postcodes!$B$2:$B$100>=P20), ROW(Postcodes!$A$2:$A$100))),\"WRONG CODE\"))","v":0},null,null,null,null,null,null,""]
[{"$f":"'Order Form'!A41","v":20},{"$f":"'Order Form'!M41","v":""},{"$f":"'Order Form'!$E$4","v":0},{"$f":"'Order Form'!$E$5","v":0},{"$f":"'Order Form'!$E$6","v":0},{"$f":"'Order Form'!$E$7","v":0},{"$f":"'Order Form'!$E$9","v":0},{"$f":"'Order Form'!$E$8","v":0},{"$f":"'Order Form'!$E$10","v":0},{"$f":"'Order Form'!$E$11","v":0},{"$f":"IF(('Order Form'!$E$15=\"YES\"),'Order Form'!$E$12,\"\")","v":0},{"$f":"'Order Form'!$E$13 & \"\"","v":""},{"$f":"IF('Order Form'!D41=\"\",'Order Form'!C41,'Order Form'!D41) & \"\"","v":""},{"$f":"'Order Form'!E41 & \"\"","v":""},{"$f":"'Order Form'!F41","v":0},{"$f":"'Order Form'!I41","v":0},{"$f":"'Order Form'!G41","v":0},{"$f":"'Order Form'!H41","v":0},{"$f":"'Order Form'!J41 & \"\"","v":""},{"$f":"'Order Form'!L41 & \"\"","v":""},{"$f":"'Order Form'!C41 & \"\"","v":""},{"$f":"'Order Form'!K41 & \"\"","v":""},{"$f":"'Order Form'!$E$14","v":"YES"},{"$f":"'Order Form'!$E$19","v":0},{"$f":"'Order Form'!$E$16","v":"FREE gift card"},{"$f":"'Order Form'!$E$17","v":"No thanks"},"No","No",{"$f":"\"Dispatch Week: \"&'Order Form'!$E$18","v":"Dispatch Week: "},{"$f":"\"VIP: \"&'Order Form'!$E$5 &\"; Rib: \"&'Order Form'!$E$17 &\"; GT: \"&'Order Form'!$E$16","v":"VIP: ; Rib: No thanks; GT: FREE gift card"},null,null,null,{"$f":"IF(P21=\"\",\"\",IFERROR(INDIRECT(\"Postcodes!$C\"&SUMPRODUCT(--(Postcodes!$A$2:$A$100<=P21)*(Postcodes!$B$2:$B$100>=P21), ROW(Postcodes!$A$2:$A$100))),\"WRONG CODE\"))","v":0},null,null,null,null,null,null,""]
[{"$f":"'Order Form'!A42","v":21},{"$f":"'Order Form'!M42","v":""},{"$f":"'Order Form'!$E$4","v":0},{"$f":"'Order Form'!$E$5","v":0},{"$f":"'Order Form'!$E$6","v":0},{"$f":"'Order Form'!$E$7","v":0},{"$f":"'Order Form'!$E$9","v":0},{"$f":"'Order Form'!$E$8","v":0},{"$f":"'Order Form'!$E$10","v":0},{"$f":"'Order Form'!$E$11","v":0},{"$f":"IF(('Order Form'!$E$15=\"YES\"),'Order Form'!$E$12,\"\")","v":0},{"$f":"'Order Form'!$E$13 & \"\"","v":""},{"$f":"IF('Order Form'!D42=\"\",'Order Form'!C42,'Order Form'!D42) & \"\"","v":""},{"$f":"'Order Form'!E42 & \"\"","v":""},{"$f":"'Order Form'!F42","v":0},{"$f":"'Order Form'!I42","v":0},{"$f":"'Order Form'!G42","v":0},{"$f":"'Order Form'!H42","v":0},{"$f":"'Order Form'!J42 & \"\"","v":""},{"$f":"'Order Form'!L42 & \"\"","v":""},{"$f":"'Order Form'!C42 & \"\"","v":""},{"$f":"'Order Form'!K42 & \"\"","v":""},{"$f":"'Order Form'!$E$14","v":"YES"},{"$f":"'Order Form'!$E$19","v":0},{"$f":"'Order Form'!$E$16","v":"FREE gift card"},{"$f":"'Order Form'!$E$17","v":"No thanks"},"No","No",{"$f":"\"Dispatch Week: \"&'Order Form'!$E$18","v":"Dispatch Week: "},{"$f":"\"VIP: \"&'Order Form'!$E$5 &\"; Rib: \"&'Order Form'!$E$17 &\"; GT: \"&'Order Form'!$E$16","v":"VIP: ; Rib: No thanks; GT: FREE gift card"},null,null,null,{"$f":"IF(P22=\"\",\"\",IFERROR(INDIRECT(\"Postcodes!$C\"&SUMPRODUCT(--(Postcodes!$A$2:$A$100<=P22)*(Postcodes!$B$2:$B$100>=P22), ROW(Postcodes!$A$2:$A$100))),\"WRONG CODE\"))","v":0},null,null,null,null,null,null,""]
[{"$f":"'Order Form'!A43","v":22},{"$f":"'Order Form'!M43","v":""},{"$f":"'Order Form'!$E$4","v":0},{"$f":"'Order Form'!$E$5","v":0},{"$f":"'Order Form'!$E$6","v":0},{"$f":"'Order Form'!$E$7","v":0},{"$f":"'Order Form'!$E$9","v":0},{"$f":"'Order Form'!$E$8","v":0},{"$f":"'Order Form'!$E$10","v":0},{"$f":"'Order Form'!$E$11","v":0},{"$f":"IF(('Order Form'!$E$15=\"YES\"),'Order Form'!$E$12,\"\")","v":0},{"$f":"'Order Form'!$E$13 & \"\"","v":""},{"$f":"IF('Order Form'!D43=\"\",'Order Form'!C43,'Order Form'!D43) & \"\"","v":""},{"$f":"'Order Form'!E43 & \"\"","v":""},{"$f":"'Order Form'!F43","v":0},{"$f":"'Order Form'!I43","v":0},{"$f":"'Order Form'!G43","v":0},{"$f":"'Order Form'!H43","v":0},{"$f":"'Order Form'!J43 & \"\"","v":""},{"$f":"'Order Form'!L43 & \"\"","v":""},{"$f":"'Order Form'!C43 & \"\"","v":""},{"$f":"'Order Form'!K43 & \"\"","v":""},{"$f":"'Order Form'!$E$14","v":"YES"},{"$f":"'Order Form'!$E$19","v":0},{"$f":"'Order Form'!$E$16","v":"FREE gift card"},{"$f":"'Order Form'!$E$17","v":"No thanks"},"No","No",{"$f":"\"Dispatch Week: \"&'Order Form'!$E$18","v":"Dispatch Week: "},{"$f":"\"VIP: \"&'Order Form'!$E$5 &\"; Rib: \"&'Order Form'!$E$17 &\"; GT: \"&'Order Form'!$E$16","v":"VIP: ; Rib: No thanks; GT: FREE gift card"},null,null,null,{"$f":"IF(P23=\"\",\"\",IFERROR(INDIRECT(\"Postcodes!$C\"&SUMPRODUCT(--(Postcodes!$A$2:$A$100<=P23)*(Postcodes!$B$2:$B$100>=P23), ROW(Postcodes!$A$2:$A$100))),\"WRONG CODE\"))","v":0},null,null,null,null,null,null,""]
[{"$f":"'Order Form'!A44","v":23},{"$f":"'Order Form'!M44","v":""},{"$f":"'Order Form'!$E$4","v":0},{"$f":"'Order Form'!$E$5","v":0},{"$f":"'Order Form'!$E$6","v":0},{"$f":"'Order Form'!$E$7","v":0},{"$f":"'Order Form'!$E$9","v":0},{"$f":"'Order Form'!$E$8","v":0},{"$f":"'Order Form'!$E$10","v":0},{"$f":"'Order Form'!$E$11","v":0},{"$f":"IF(('Order Form'!$E$15=\"YES\"),'Order Form'!$E$12,\"\")","v":0},{"$f":"'Order Form'!$E$13 & \"\"","v":""},{"$f":"IF('Order Form'!D44=\"\",'Order Form'!C44,'Order Form'!D44) & \"\"","v":""},{"$f":"'Order Form'!E44 & \"\"","v":""},{"$f":"'Order Form'!F44","v":0},{"$f":"'Order Form'!I44","v":0},{"$f":"'Order Form'!G44","v":0},{"$f":"'Order Form'!H44","v":0},{"$f":"'Order Form'!J44 & \"\"","v":""},{"$f":"'Order Form'!L44 & \"\"","v":""},{"$f":"'Order Form'!C44 & \"\"","v":""},{"$f":"'Order Form'!K44 & \"\"","v":""},{"$f":"'Order Form'!$E$14","v":"YES"},{"$f":"'Order Form'!$E$19","v":0},{"$f":"'Order Form'!$E$16","v":"FREE gift card"},{"$f":"'Order Form'!$E$17","v":"No thanks"},"No","No",{"$f":"\"Dispatch Week: \"&'Order Form'!$E$18","v":"Dispatch Week: "},{"$f":"\"VIP: \"&'Order Form'!$E$5 &\"; Rib: \"&'Order Form'!$E$17 &\"; GT: \"&'Order Form'!$E$16","v":"VIP: ; Rib: No thanks; GT: FREE gift card"},null,null,null,{"$f":"IF(P24=\"\",\"\",IFERROR(INDIRECT(\"Postcodes!$C\"&SUMPRODUCT(--(Postcodes!$A$2:$A$100<=P24)*(Postcodes!$B$2:$B$100>=P24), ROW(Postcodes!$A$2:$A$100))),\"WRONG CODE\"))","v":0},null,null,null,null,null,null,""]
[{"$f":"'Order Form'!A45","v":24},{"$f":"'Order Form'!M45","v":""},{"$f":"'Order Form'!$E$4","v":0},{"$f":"'Order Form'!$E$5","v":0},{"$f":"'Order Form'!$E$6","v":0},{"$f":"'Order Form'!$E$7","v":0},{"$f":"'Order Form'!$E$9","v":0},{"$f":"'Order Form'!$E$8","v":0},{"$f":"'Order Form'!$E$10","v":0},{"$f":"'Order Form'!$E$11","v":0},{"$f":"IF(('Order Form'!$E$15=\"YES\"),'Order Form'!$E$12,\"\")","v":0},{"$f":"'Order Form'!$E$13 & \"\"","v":""},{"$f":"IF('Order Form'!D45=\"\",'Order Form'!C45,'Order Form'!D45) & \"\"","v":""},{"$f":"'Order Form'!E45 & \"\"","v":""},{"$f":"'Order Form'!F45","v":0},{"$f":"'Order Form'!I45","v":0},{"$f":"'Order Form'!G45","v":0},{"$f":"'Order Form'!H45","v":0},{"$f":"'Order Form'!J45 & \"\"","v":""},{"$f":"'Order Form'!L45 & \"\"","v":""},{"$f":"'Order Form'!C45 & \"\"","v":""},{"$f":"'Order Form'!K45 & \"\"","v":""},{"$f":"'Order Form'!$E$14","v":"YES"},{"$f":"'Order Form'!$E$19","v":0},{"$f":"'Order Form'!$E$16","v":"FREE gift card"},{"$f":"'Order Form'!$E$17","v":"No thanks"},"No","No",{"$f":"\"Dispatch Week: \"&'Order Form'!$E$18","v":"Dispatch Week: "},{"$f":"\"VIP: \"&'Order Form'!$E$5 &\"; Rib: \"&'Order Form'!$E$17 &\"; GT: \"&'Order Form'!$E$16","v":"VIP: ; Rib: No thanks; GT: FREE gift card"},null,null,null,{"$f":"IF(P25=\"\",\"\",IFERROR(INDIRECT(\"Postcodes!$C\"&SUMPRODUCT(--(Postcodes!$A$2:$A$100<=P25)*(Postcodes!$B$2:$B$100>=P25), ROW(Postcodes!$A$2:$A$100))),\"WRONG CODE\"))","v":0},null,null,null,null,null,null,""]
[{"$f":"'Order Form'!A46","v":25},{"$f":"'Order Form'!M46","v":""},{"$f":"'Order Form'!$E$4","v":0},{"$f":"'Order Form'!$E$5","v":0},{"$f":"'Order Form'!$E$6","v":0},{"$f":"'Order Form'!$E$7","v":0},{"$f":"'Order Form'!$E$9","v":0},{"$f":"'Order Form'!$E$8","v":0},{"$f":"'Order Form'!$E$10","v":0},{"$f":"'Order Form'!$E$11","v":0},{"$f":"IF(('Order Form'!$E$15=\"YES\"),'Order Form'!$E$12,\"\")","v":0},{"$f":"'Order Form'!$E$13 & \"\"","v":""},{"$f":"IF('Order Form'!D46=\"\",'Order Form'!C46,'Order Form'!D46) & \"\"","v":""},{"$f":"'Order Form'!E46 & \"\"","v":""},{"$f":"'Order Form'!F46","v":0},{"$f":"'Order Form'!I46","v":0},{"$f":"'Order Form'!G46","v":0},{"$f":"'Order Form'!H46","v":0},{"$f":"'Order Form'!J46 & \"\"","v":""},{"$f":"'Order Form'!L46 & \"\"","v":""},{"$f":"'Order Form'!C46 & \"\"","v":""},{"$f":"'Order Form'!K46 & \"\"","v":""},{"$f":"'Order Form'!$E$14","v":"YES"},{"$f":"'Order Form'!$E$19","v":0},{"$f":"'Order Form'!$E$16","v":"FREE gift card"},{"$f":"'Order Form'!$E$17","v":"No thanks"},"No","No",{"$f":"\"Dispatch Week: \"&'Order Form'!$E$18","v":"Dispatch Week: "},{"$f":"\"VIP: \"&'Order Form'!$E$5 &\"; Rib: \"&'Order Form'!$E$17 &\"; GT: \"&'Order Form'!$E$16","v":"VIP: ; Rib: No thanks; GT: FREE gift card"},null,null,null,{"$f":"IF(P26=\"\",\"\",IFERROR(INDIRECT(\"Postcodes!$C\"&SUMPRODUCT(--(Postcodes!$A$2:$A$100<=P26)*(Postcodes!$B$2:$B$100>=P26), ROW(Postcodes!$A$2:$A$100))),\"WRONG CODE\"))","v":0},null,null,null,null,null,null,""]
[{"$f":"'Order Form'!A47","v":26},{"$f":"'Order Form'!M47","v":""},{"$f":"'Order Form'!$E$4","v":0},{"$f":"'Order Form'!$E$5","v":0},{"$f":"'Order Form'!$E$6","v":0},{"$f":"'Order Form'!$E$7","v":0},{"$f":"'Order Form'!$E$9","v":0},{"$f":"'Order Form'!$E$8","v":0},{"$f":"'Order Form'!$E$10","v":0},{"$f":"'Order Form'!$E$11","v":0},{"$f":"IF(('Order Form'!$E$15=\"YES\"),'Order Form'!$E$12,\"\")","v":0},{"$f":"'Order Form'!$E$13 & \"\"","v":""},{"$f":"IF('Order Form'!D47=\"\",'Order Form'!C47,'Order Form'!D47) & \"\"","v":""},{"$f":"'Order Form'!E47 & \"\"","v":""},{"$f":"'Order Form'!F47","v":0},{"$f":"'Order Form'!I47","v":0},{"$f":"'Order Form'!G47","v":0},{"$f":"'Order Form'!H47","v":0},{"$f":"'Order Form'!J47 & \"\"","v":""},{"$f":"'Order Form'!L47 & \"\"","v":""},{"$f":"'Order Form'!C47 & \"\"","v":""},{"$f":"'Order Form'!K47 & \"\"","v":""},{"$f":"'Order Form'!$E$14","v":"YES"},{"$f":"'Order Form'!$E$19","v":0},{"$f":"'Order Form'!$E$16","v":"FREE gift card"},{"$f":"'Order Form'!$E$17","v":"No thanks"},"No","No",{"$f":"\"Dispatch Week: \"&'Order Form'!$E$18","v":"Dispatch Week: "},{"$f":"\"VIP: \"&'Order Form'!$E$5 &\"; Rib: \"&'Order Form'!$E$17 &\"; GT: \"&'Order Form'!$E$16","v":"VIP: ; Rib: No thanks; GT: FREE gift card"},null,null,null,{"$f":"IF(P27=\"\",\"\",IFERROR(INDIRECT(\"Postcodes!$C\"&SUMPRODUCT(--(Postcodes!$A$2:$A$100<=P27)*(Postcodes!$B$2:$B$100>=P27), ROW(Postcodes!$A$2:$A$100))),\"WRONG CODE\"))","v":0},null,null,null,null,null,null,""]
[{"$f":"'Order Form'!A48","v":27},{"$f":"'Order Form'!M48","v":""},{"$f":"'Order Form'!$E$4","v":0},{"$f":"'Order Form'!$E$5","v":0},{"$f":"'Order Form'!$E$6","v":0},{"$f":"'Order Form'!$E$7","v":0},{"$f":"'Order Form'!$E$9","v":0},{"$f":"'Order Form'!$E$8","v":0},{"$f":"'Order Form'!$E$10","v":0},{"$f":"'Order Form'!$E$11","v":0},{"$f":"IF(('Order Form'!$E$15=\"YES\"),'Order Form'!$E$12,\"\")","v":0},{"$f":"'Order Form'!$E$13 & \"\"","v":""},{"$f":"IF('Order Form'!D48=\"\",'Order Form'!C48,'Order Form'!D48) & \"\"","v":""},{"$f":"'Order Form'!E48 & \"\"","v":""},{"$f":"'Order Form'!F48","v":0},{"$f":"'Order Form'!I48","v":0},{"$f":"'Order Form'!G48","v":0},{"$f":"'Order Form'!H48","v":0},{"$f":"'Order Form'!J48 & \"\"","v":""},{"$f":"'Order Form'!L48 & \"\"","v":""},{"$f":"'Order Form'!C48 & \"\"","v":""},{"$f":"'Order Form'!K48 & \"\"","v":""},{"$f":"'Order Form'!$E$14","v":"YES"},{"$f":"'Order Form'!$E$19","v":0},{"$f":"'Order Form'!$E$16","v":"FREE gift card"},{"$f":"'Order Form'!$E$17","v":"No thanks"},"No","No",{"$f":"\"Dispatch Week: \"&'Order Form'!$E$18","v":"Dispatch Week: "},{"$f":"\"VIP: \"&'Order Form'!$E$5 &\"; Rib: \"&'Order Form'!$E$17 &\"; GT: \"&'Order Form'!$E$16","v":"VIP: ; Rib: No thanks; GT: FREE gift card"},null,null,null,{"$f":"IF(P28=\"\",\"\",IFERROR(INDIRECT(\"Postcodes!$C\"&SUMPRODUCT(--(Postcodes!$A$2:$A$100<=P28)*(Postcodes!$B$2:$B$100>=P28), ROW(Postcodes!$A$2:$A$100))),\"WRONG CODE\"))","v":0},null,null,null,null,null,null,""]
[{"$f":"'Order Form'!A49","v":28},{"$f":"'Order Form'!M49","v":""},{"$f":"'Order Form'!$E$4","v":0},{"$f":"'Order Form'!$E$5","v":0},{"$f":"'Order Form'!$E$6","v":0},{"$f":"'Order Form'!$E$7","v":0},{"$f":"'Order Form'!$E$9","v":0},{"$f":"'Order Form'!$E$8","v":0},{"$f":"'Order Form'!$E$10","v":0},{"$f":"'Order Form'!$E$11","v":0},{"$f":"IF(('Order Form'!$E$15=\"YES\"),'Order Form'!$E$12,\"\")","v":0},{"$f":"'Order Form'!$E$13 & \"\"","v":""},{"$f":"IF('Order Form'!D49=\"\",'Order Form'!C49,'Order Form'!D49) & \"\"","v":""},{"$f":"'Order Form'!E49 & \"\"","v":""},{"$f":"'Order Form'!F49","v":0},{"$f":"'Order Form'!I49","v":0},{"$f":"'Order Form'!G49","v":0},{"$f":"'Order Form'!H49","v":0},{"$f":"'Order Form'!J49 & \"\"","v":""},{"$f":"'Order Form'!L49 & \"\"","v":""},{"$f":"'Order Form'!C49 & \"\"","v":""},{"$f":"'Order Form'!K49 & \"\"","v":""},{"$f":"'Order Form'!$E$14","v":"YES"},{"$f":"'Order Form'!$E$19","v":0},{"$f":"'Order Form'!$E$16","v":"FREE gift card"},{"$f":"'Order Form'!$E$17","v":"No thanks"},"No","No",{"$f":"\"Dispatch Week: \"&'Order Form'!$E$18","v":"Dispatch Week: "},{"$f":"\"VIP: \"&'Order Form'!$E$5 &\"; Rib: \"&'Order Form'!$E$17 &\"; GT: \"&'Order Form'!$E$16","v":"VIP: ; Rib: No thanks; GT: FREE gift card"},null,null,null,{"$f":"IF(P29=\"\",\"\",IFERROR(INDIRECT(\"Postcodes!$C\"&SUMPRODUCT(--(Postcodes!$A$2:$A$100<=P29)*(Postcodes!$B$2:$B$100>=P29), ROW(Postcodes!$A$2:$A$100))),\"WRONG CODE\"))","v":0},null,null,null,null,null,null,""]
[{"$f":"'Order Form'!A50","v":29},{"$f":"'Order Form'!M50","v":""},{"$f":"'Order Form'!$E$4","v":0},{"$f":"'Order Form'!$E$5","v":0},{"$f":"'Order Form'!$E$6","v":0},{"$f":"'Order Form'!$E$7","v":0},{"$f":"'Order Form'!$E$9","v":0},{"$f":"'Order Form'!$E$8","v":0},{"$f":"'Order Form'!$E$10","v":0},{"$f":"'Order Form'!$E$11","v":0},{"$f":"IF(('Order Form'!$E$15=\"YES\"),'Order Form'!$E$12,\"\")","v":0},{"$f":"'Order Form'!$E$13 & \"\"","v":""},{"$f":"IF('Order Form'!D50=\"\",'Order Form'!C50,'Order Form'!D50) & \"\"","v":""},{"$f":"'Order Form'!E50 & \"\"","v":""},{"$f":"'Order Form'!F50","v":0},{"$f":"'Order Form'!I50","v":0},{"$f":"'Order Form'!G50","v":0},{"$f":"'Order Form'!H50","v":0},{"$f":"'Order Form'!J50 & \"\"","v":""},{"$f":"'Order Form'!L50 & \"\"","v":""},{"$f":"'Order Form'!C50 & \"\"","v":""},{"$f":"'Order Form'!K50 & \"\"","v":""},{"$f":"'Order Form'!$E$14","v":"YES"},{"$f":"'Order Form'!$E$19","v":0},{"$f":"'Order Form'!$E$16","v":"FREE gift card"},{"$f":"'Order Form'!$E$17","v":"No thanks"},"No","No",{"$f":"\"Dispatch Week: \"&'Order Form'!$E$18","v":"Dispatch Week: "},{"$f":"\"VIP: \"&'Order Form'!$E$5 &\"; Rib: \"&'Order Form'!$E$17 &\"; GT: \"&'Order Form'!$E$16","v":"VIP: ; Rib: No thanks; GT: FREE gift card"},null,null,null,{"$f":"IF(P30=\"\",\"\",IFERROR(INDIRECT(\"Postcodes!$C\"&SUMPRODUCT(--(Postcodes!$A$2:$A$100<=P30)*(Postcodes!$B$2:$B$100>=P30), ROW(Postcodes!$A$2:$A$100))),\"WRONG CODE\"))","v":0},null,null,null,null,null,null,""]
[{"$f":"'Order Form'!A51","v":30},{"$f":"'Order Form'!M51","v":""},{"$f":"'Order Form'!$E$4","v":0},{"$f":"'Order Form'!$E$5","v":0},{"$f":"'Order Form'!$E$6","v":0},{"$f":"'Order Form'!$E$7","v":0},{"$f":"'Order Form'!$E$9","v":0},{"$f":"'Order Form'!$E$8","v":0},{"$f":"'Order Form'!$E$10","v":0},{"$f":"'Order Form'!$E$11","v":0},{"$f":"IF(('Order Form'!$E$15=\"YES\"),'Order Form'!$E$12,\"\")","v":0},{"$f":"'Order Form'!$E$13 & \"\"","v":""},{"$f":"IF('Order Form'!D51=\"\",'Order Form'!C51,'Order Form'!D51) & \"\"","v":""},{"$f":"'Order Form'!E51 & \"\"","v":""},{"$f":"'Order Form'!F51","v":0},{"$f":"'Order Form'!I51","v":0},{"$f":"'Order Form'!G51","v":0},{"$f":"'Order Form'!H51","v":0},{"$f":"'Order Form'!J51 & \"\"","v":""},{"$f":"'Order Form'!L51 & \"\"","v":""},{"$f":"'Order Form'!C51 & \"\"","v":""},{"$f":"'Order Form'!K51 & \"\"","v":""},{"$f":"'Order Form'!$E$14","v":"YES"},{"$f":"'Order Form'!$E$19","v":0},{"$f":"'Order Form'!$E$16","v":"FREE gift card"},{"$f":"'Order Form'!$E$17","v":"No thanks"},"No","No",{"$f":"\"Dispatch Week: \"&'Order Form'!$E$18","v":"Dispatch Week: "},{"$f":"\"VIP: \"&'Order Form'!$E$5 &\"; Rib: \"&'Order Form'!$E$17 &\"; GT: \"&'Order Form'!$E$16","v":"VIP: ; Rib: No thanks; GT: FREE gift card"},null,null,null,{"$f":"IF(P31=\"\",\"\",IFERROR(INDIRECT(\"Postcodes!$C\"&SUMPRODUCT(--(Postcodes!$A$2:$A$100<=P31)*(Postcodes!$B$2:$B$100>=P31), ROW(Postcodes!$A$2:$A$100))),\"WRONG CODE\"))","v":0},null,null,null,null,null,null,""]
[{"$f":"'Order Form'!A52","v":31},{"$f":"'Order Form'!M52","v":""},{"$f":"'Order Form'!$E$4","v":0},{"$f":"'Order Form'!$E$5","v":0},{"$f":"'Order Form'!$E$6","v":0},{"$f":"'Order Form'!$E$7","v":0},{"$f":"'Order Form'!$E$9","v":0},{"$f":"'Order Form'!$E$8","v":0},{"$f":"'Order Form'!$E$10","v":0},{"$f":"'Order Form'!$E$11","v":0},{"$f":"IF(('Order Form'!$E$15=\"YES\"),'Order Form'!$E$12,\"\")","v":0},{"$f":"'Order Form'!$E$13 & \"\"","v":""},{"$f":"IF('Order Form'!D52=\"\",'Order Form'!C52,'Order Form'!D52) & \"\"","v":""},{"$f":"'Order Form'!E52 & \"\"","v":""},{"$f":"'Order Form'!F52","v":0},{"$f":"'Order Form'!I52","v":0},{"$f":"'Order Form'!G52","v":0},{"$f":"'Order Form'!H52","v":0},{"$f":"'Order Form'!J52 & \"\"","v":""},{"$f":"'Order Form'!L52 & \"\"","v":""},{"$f":"'Order Form'!C52 & \"\"","v":""},{"$f":"'Order Form'!K52 & \"\"","v":""},{"$f":"'Order Form'!$E$14","v":"YES"},{"$f":"'Order Form'!$E$19","v":0},{"$f":"'Order Form'!$E$16","v":"FREE gift card"},{"$f":"'Order Form'!$E$17","v":"No thanks"},"No","No",{"$f":"\"Dispatch Week: \"&'Order Form'!$E$18","v":"Dispatch Week: "},{"$f":"\"VIP: \"&'Order Form'!$E$5 &\"; Rib: \"&'Order Form'!$E$17 &\"; GT: \"&'Order Form'!$E$16","v":"VIP: ; Rib: No thanks; GT: FREE gift card"},null,null,null,{"$f":"IF(P32=\"\",\"\",IFERROR(INDIRECT(\"Postcodes!$C\"&SUMPRODUCT(--(Postcodes!$A$2:$A$100<=P32)*(Postcodes!$B$2:$B$100>=P32), ROW(Postcodes!$A$2:$A$100))),\"WRONG CODE\"))","v":0},null,null,null,null,null,null,""]
[{"$f":"'Order Form'!A53","v":32},{"$f":"'Order Form'!M53","v":""},{"$f":"'Order Form'!$E$4","v":0},{"$f":"'Order Form'!$E$5","v":0},{"$f":"'Order Form'!$E$6","v":0},{"$f":"'Order Form'!$E$7","v":0},{"$f":"'Order Form'!$E$9","v":0},{"$f":"'Order Form'!$E$8","v":0},{"$f":"'Order Form'!$E$10","v":0},{"$f":"'Order Form'!$E$11","v":0},{"$f":"IF(('Order Form'!$E$15=\"YES\"),'Order Form'!$E$12,\"\")","v":0},{"$f":"'Order Form'!$E$13 & \"\"","v":""},{"$f":"IF('Order Form'!D53=\"\",'Order Form'!C53,'Order Form'!D53) & \"\"","v":""},{"$f":"'Order Form'!E53 & \"\"","v":""},{"$f":"'Order Form'!F53","v":0},{"$f":"'Order Form'!I53","v":0},{"$f":"'Order Form'!G53","v":0},{"$f":"'Order Form'!H53","v":0},{"$f":"'Order Form'!J53 & \"\"","v":""},{"$f":"'Order Form'!L53 & \"\"","v":""},{"$f":"'Order Form'!C53 & \"\"","v":""},{"$f":"'Order Form'!K53 & \"\"","v":""},{"$f":"'Order Form'!$E$14","v":"YES"},{"$f":"'Order Form'!$E$19","v":0},{"$f":"'Order Form'!$E$16","v":"FREE gift card"},{"$f":"'Order Form'!$E$17","v":"No thanks"},"No","No",{"$f":"\"Dispatch Week: \"&'Order Form'!$E$18","v":"Dispatch Week: "},{"$f":"\"VIP: \"&'Order Form'!$E$5 &\"; Rib: \"&'Order Form'!$E$17 &\"; GT: \"&'Order Form'!$E$16","v":"VIP: ; Rib: No thanks; GT: FREE gift card"},null,null,null,{"$f":"IF(P33=\"\",\"\",IFERROR(INDIRECT(\"Postcodes!$C\"&SUMPRODUCT(--(Postcodes!$A$2:$A$100<=P33)*(Postcodes!$B$2:$B$100>=P33), ROW(Postcodes!$A$2:$A$100))),\"WRONG CODE\"))","v":0},null,null,null,null,null,null,""]
[{"$f":"'Order Form'!A54","v":33},{"$f":"'Order Form'!M54","v":""},{"$f":"'Order Form'!$E$4","v":0},{"$f":"'Order Form'!$E$5","v":0},{"$f":"'Order Form'!$E$6","v":0},{"$f":"'Order Form'!$E$7","v":0},{"$f":"'Order Form'!$E$9","v":0},{"$f":"'Order Form'!$E$8","v":0},{"$f":"'Order Form'!$E$10","v":0},{"$f":"'Order Form'!$E$11","v":0},{"$f":"IF(('Order Form'!$E$15=\"YES\"),'Order Form'!$E$12,\"\")","v":0},{"$f":"'Order Form'!$E$13 & \"\"","v":""},{"$f":"IF('Order Form'!D54=\"\",'Order Form'!C54,'Order Form'!D54) & \"\"","v":""},{"$f":"'Order Form'!E54 & \"\"","v":""},{"$f":"'Order Form'!F54","v":0},{"$f":"'Order Form'!I54","v":0},{"$f":"'Order Form'!G54","v":0},{"$f":"'Order Form'!H54","v":0},{"$f":"'Order Form'!J54 & \"\"","v":""},{"$f":"'Order Form'!L54 & \"\"","v":""},{"$f":"'Order Form'!C54 & \"\"","v":""},{"$f":"'Order Form'!K54 & \"\"","v":""},{"$f":"'Order Form'!$E$14","v":"YES"},{"$f":"'Order Form'!$E$19","v":0},{"$f":"'Order Form'!$E$16","v":"FREE gift card"},{"$f":"'Order Form'!$E$17","v":"No thanks"},"No","No",{"$f":"\"Dispatch Week: \"&'Order Form'!$E$18","v":"Dispatch Week: "},{"$f":"\"VIP: \"&'Order Form'!$E$5 &\"; Rib: \"&'Order Form'!$E$17 &\"; GT: \"&'Order Form'!$E$16","v":"VIP: ; Rib: No thanks; GT: FREE gift card"},null,null,null,{"$f":"IF(P34=\"\",\"\",IFERROR(INDIRECT(\"Postcodes!$C\"&SUMPRODUCT(--(Postcodes!$A$2:$A$100<=P34)*(Postcodes!$B$2:$B$100>=P34), ROW(Postcodes!$A$2:$A$100))),\"WRONG CODE\"))","v":0},null,null,null,null,null,null,""]
[{"$f":"'Order Form'!A55","v":34},{"$f":"'Order Form'!M55","v":""},{"$f":"'Order Form'!$E$4","v":0},{"$f":"'Order Form'!$E$5","v":0},{"$f":"'Order Form'!$E$6","v":0},{"$f":"'Order Form'!$E$7","v":0},{"$f":"'Order Form'!$E$9","v":0},{"$f":"'Order Form'!$E$8","v":0},{"$f":"'Order Form'!$E$10","v":0},{"$f":"'Order Form'!$E$11","v":0},{"$f":"IF(('Order Form'!$E$15=\"YES\"),'Order Form'!$E$12,\"\")","v":0},{"$f":"'Order Form'!$E$13 & \"\"","v":""},{"$f":"IF('Order Form'!D55=\"\",'Order Form'!C55,'Order Form'!D55) & \"\"","v":""},{"$f":"'Order Form'!E55 & \"\"","v":""},{"$f":"'Order Form'!F55","v":0},{"$f":"'Order Form'!I55","v":0},{"$f":"'Order Form'!G55","v":0},{"$f":"'Order Form'!H55","v":0},{"$f":"'Order Form'!J55 & \"\"","v":""},{"$f":"'Order Form'!L55 & \"\"","v":""},{"$f":"'Order Form'!C55 & \"\"","v":""},{"$f":"'Order Form'!K55 & \"\"","v":""},{"$f":"'Order Form'!$E$14","v":"YES"},{"$f":"'Order Form'!$E$19","v":0},{"$f":"'Order Form'!$E$16","v":"FREE gift card"},{"$f":"'Order Form'!$E$17","v":"No thanks"},"No","No",{"$f":"\"Dispatch Week: \"&'Order Form'!$E$18","v":"Dispatch Week: "},{"$f":"\"VIP: \"&'Order Form'!$E$5 &\"; Rib: \"&'Order Form'!$E$17 &\"; GT: \"&'Order Form'!$E$16","v":"VIP: ; Rib: No thanks; GT: FREE gift card"},null,null,null,{"$f":"IF(P35=\"\",\"\",IFERROR(INDIRECT(\"Postcodes!$C\"&SUMPRODUCT(--(Postcodes!$A$2:$A$100<=P35)*(Postcodes!$B$2:$B$100>=P35), ROW(Postcodes!$A$2:$A$100))),\"WRONG CODE\"))","v":0},null,null,null,null,null,null,""]
[{"$f":"'Order Form'!A56","v":35},{"$f":"'Order Form'!M56","v":""},{"$f":"'Order Form'!$E$4","v":0},{"$f":"'Order Form'!$E$5","v":0},{"$f":"'Order Form'!$E$6","v":0},{"$f":"'Order Form'!$E$7","v":0},{"$f":"'Order Form'!$E$9","v":0},{"$f":"'Order Form'!$E$8","v":0},{"$f":"'Order Form'!$E$10","v":0},{"$f":"'Order Form'!$E$11","v":0},{"$f":"IF(('Order Form'!$E$15=\"YES\"),'Order Form'!$E$12,\"\")","v":0},{"$f":"'Order Form'!$E$13 & \"\"","v":""},{"$f":"IF('Order Form'!D56=\"\",'Order Form'!C56,'Order Form'!D56) & \"\"","v":""},{"$f":"'Order Form'!E56 & \"\"","v":""},{"$f":"'Order Form'!F56","v":0},{"$f":"'Order Form'!I56","v":0},{"$f":"'Order Form'!G56","v":0},{"$f":"'Order Form'!H56","v":0},{"$f":"'Order Form'!J56 & \"\"","v":""},{"$f":"'Order Form'!L56 & \"\"","v":""},{"$f":"'Order Form'!C56 & \"\"","v":""},{"$f":"'Order Form'!K56 & \"\"","v":""},{"$f":"'Order Form'!$E$14","v":"YES"},{"$f":"'Order Form'!$E$19","v":0},{"$f":"'Order Form'!$E$16","v":"FREE gift card"},{"$f":"'Order Form'!$E$17","v":"No thanks"},"No","No",{"$f":"\"Dispatch Week: \"&'Order Form'!$E$18","v":"Dispatch Week: "},{"$f":"\"VIP: \"&'Order Form'!$E$5 &\"; Rib: \"&'Order Form'!$E$17 &\"; GT: \"&'Order Form'!$E$16","v":"VIP: ; Rib: No thanks; GT: FREE gift card"},null,null,null,{"$f":"IF(P36=\"\",\"\",IFERROR(INDIRECT(\"Postcodes!$C\"&SUMPRODUCT(--(Postcodes!$A$2:$A$100<=P36)*(Postcodes!$B$2:$B$100>=P36), ROW(Postcodes!$A$2:$A$100))),\"WRONG CODE\"))","v":0},null,null,null,null,null,null,""]
[{"$f":"'Order Form'!A57","v":36},{"$f":"'Order Form'!M57","v":""},{"$f":"'Order Form'!$E$4","v":0},{"$f":"'Order Form'!$E$5","v":0},{"$f":"'Order Form'!$E$6","v":0},{"$f":"'Order Form'!$E$7","v":0},{"$f":"'Order Form'!$E$9","v":0},{"$f":"'Order Form'!$E$8","v":0},{"$f":"'Order Form'!$E$10","v":0},{"$f":"'Order Form'!$E$11","v":0},{"$f":"IF(('Order Form'!$E$15=\"YES\"),'Order Form'!$E$12,\"\")","v":0},{"$f":"'Order Form'!$E$13 & \"\"","v":""},{"$f":"IF('Order Form'!D57=\"\",'Order Form'!C57,'Order Form'!D57) & \"\"","v":""},{"$f":"'Order Form'!E57 & \"\"","v":""},{"$f":"'Order Form'!F57","v":0},{"$f":"'Order Form'!I57","v":0},{"$f":"'Order Form'!G57","v":0},{"$f":"'Order Form'!H57","v":0},{"$f":"'Order Form'!J57 & \"\"","v":""},{"$f":"'Order Form'!L57 & \"\"","v":""},{"$f":"'Order Form'!C57 & \"\"","v":""},{"$f":"'Order Form'!K57 & \"\"","v":""},{"$f":"'Order Form'!$E$14","v":"YES"},{"$f":"'Order Form'!$E$19","v":0},{"$f":"'Order Form'!$E$16","v":"FREE gift card"},{"$f":"'Order Form'!$E$17","v":"No thanks"},"No","No",{"$f":"\"Dispatch Week: \"&'Order Form'!$E$18","v":"Dispatch Week: "},{"$f":"\"VIP: \"&'Order Form'!$E$5 &\"; Rib: \"&'Order Form'!$E$17 &\"; GT: \"&'Order Form'!$E$16","v":"VIP: ; Rib: No thanks; GT: FREE gift card"},null,null,null,{"$f":"IF(P37=\"\",\"\",IFERROR(INDIRECT(\"Postcodes!$C\"&SUMPRODUCT(--(Postcodes!$A$2:$A$100<=P37)*(Postcodes!$B$2:$B$100>=P37), ROW(Postcodes!$A$2:$A$100))),\"WRONG CODE\"))","v":0},null,null,null,null,null,null,""]
[{"$f":"'Order Form'!A58","v":37},{"$f":"'Order Form'!M58","v":""},{"$f":"'Order Form'!$E$4","v":0},{"$f":"'Order Form'!$E$5","v":0},{"$f":"'Order Form'!$E$6","v":0},{"$f":"'Order Form'!$E$7","v":0},{"$f":"'Order Form'!$E$9","v":0},{"$f":"'Order Form'!$E$8","v":0},{"$f":"'Order Form'!$E$10","v":0},{"$f":"'Order Form'!$E$11","v":0},{"$f":"IF(('Order Form'!$E$15=\"YES\"),'Order Form'!$E$12,\"\")","v":0},{"$f":"'Order Form'!$E$13 & \"\"","v":""},{"$f":"IF('Order Form'!D58=\"\",'Order Form'!C58,'Order Form'!D58) & \"\"","v":""},{"$f":"'Order Form'!E58 & \"\"","v":""},{"$f":"'Order Form'!F58","v":0},{"$f":"'Order Form'!I58","v":0},{"$f":"'Order Form'!G58","v":0},{"$f":"'Order Form'!H58","v":0},{"$f":"'Order Form'!J58 & \"\"","v":""},{"$f":"'Order Form'!L58 & \"\"","v":""},{"$f":"'Order Form'!C58 & \"\"","v":""},{"$f":"'Order Form'!K58 & \"\"","v":""},{"$f":"'Order Form'!$E$14","v":"YES"},{"$f":"'Order Form'!$E$19","v":0},{"$f":"'Order Form'!$E$16","v":"FREE gift card"},{"$f":"'Order Form'!$E$17","v":"No thanks"},"No","No",{"$f":"\"Dispatch Week: \"&'Order Form'!$E$18","v":"Dispatch Week: "},{"$f":"\"VIP: \"&'Order Form'!$E$5 &\"; Rib: \"&'Order Form'!$E$17 &\"; GT: \"&'Order Form'!$E$16","v":"VIP: ; Rib: No thanks; GT: FREE gift card"},null,null,null,{"$f":"IF(P38=\"\",\"\",IFERROR(INDIRECT(\"Postcodes!$C\"&SUMPRODUCT(--(Postcodes!$A$2:$A$100<=P38)*(Postcodes!$B$2:$B$100>=P38), ROW(Postcodes!$A$2:$A$100))),\"WRONG CODE\"))","v":0},null,null,null,null,null,null,""]
[{"$f":"'Order Form'!A59","v":38},{"$f":"'Order Form'!M59","v":""},{"$f":"'Order Form'!$E$4","v":0},{"$f":"'Order Form'!$E$5","v":0},{"$f":"'Order Form'!$E$6","v":0},{"$f":"'Order Form'!$E$7","v":0},{"$f":"'Order Form'!$E$9","v":0},{"$f":"'Order Form'!$E$8","v":0},{"$f":"'Order Form'!$E$10","v":0},{"$f":"'Order Form'!$E$11","v":0},{"$f":"IF(('Order Form'!$E$15=\"YES\"),'Order Form'!$E$12,\"\")","v":0},{"$f":"'Order Form'!$E$13 & \"\"","v":""},{"$f":"IF('Order Form'!D59=\"\",'Order Form'!C59,'Order Form'!D59) & \"\"","v":""},{"$f":"'Order Form'!E59 & \"\"","v":""},{"$f":"'Order Form'!F59","v":0},{"$f":"'Order Form'!I59","v":0},{"$f":"'Order Form'!G59","v":0},{"$f":"'Order Form'!H59","v":0},{"$f":"'Order Form'!J59 & \"\"","v":""},{"$f":"'Order Form'!L59 & \"\"","v":""},{"$f":"'Order Form'!C59 & \"\"","v":""},{"$f":"'Order Form'!K59 & \"\"","v":""},{"$f":"'Order Form'!$E$14","v":"YES"},{"$f":"'Order Form'!$E$19","v":0},{"$f":"'Order Form'!$E$16","v":"FREE gift card"},{"$f":"'Order Form'!$E$17","v":"No thanks"},"No","No",{"$f":"\"Dispatch Week: \"&'Order Form'!$E$18","v":"Dispatch Week: "},{"$f":"\"VIP: \"&'Order Form'!$E$5 &\"; Rib: \"&'Order Form'!$E$17 &\"; GT: \"&'Order Form'!$E$16","v":"VIP: ; Rib: No thanks; GT: FREE gift card"},null,null,null,{"$f":"IF(P39=\"\",\"\",IFERROR(INDIRECT(\"Postcodes!$C\"&SUMPRODUCT(--(Postcodes!$A$2:$A$100<=P39)*(Postcodes!$B$2:$B$100>=P39), ROW(Postcodes!$A$2:$A$100))),\"WRONG CODE\"))","v":0},null,null,null,null,null,null,""]
[{"$f":"'Order Form'!A60","v":39},{"$f":"'Order Form'!M60","v":""},{"$f":"'Order Form'!$E$4","v":0},{"$f":"'Order Form'!$E$5","v":0},{"$f":"'Order Form'!$E$6","v":0},{"$f":"'Order Form'!$E$7","v":0},{"$f":"'Order Form'!$E$9","v":0},{"$f":"'Order Form'!$E$8","v":0},{"$f":"'Order Form'!$E$10","v":0},{"$f":"'Order Form'!$E$11","v":0},{"$f":"IF(('Order Form'!$E$15=\"YES\"),'Order Form'!$E$12,\"\")","v":0},{"$f":"'Order Form'!$E$13 & \"\"","v":""},{"$f":"IF('Order Form'!D60=\"\",'Order Form'!C60,'Order Form'!D60) & \"\"","v":""},{"$f":"'Order Form'!E60 & \"\"","v":""},{"$f":"'Order Form'!F60","v":0},{"$f":"'Order Form'!I60","v":0},{"$f":"'Order Form'!G60","v":0},{"$f":"'Order Form'!H60","v":0},{"$f":"'Order Form'!J60 & \"\"","v":""},{"$f":"'Order Form'!L60 & \"\"","v":""},{"$f":"'Order Form'!C60 & \"\"","v":""},{"$f":"'Order Form'!K60 & \"\"","v":""},{"$f":"'Order Form'!$E$14","v":"YES"},{"$f":"'Order Form'!$E$19","v":0},{"$f":"'Order Form'!$E$16","v":"FREE gift card"},{"$f":"'Order Form'!$E$17","v":"No thanks"},"No","No",{"$f":"\"Dispatch Week: \"&'Order Form'!$E$18","v":"Dispatch Week: "},{"$f":"\"VIP: \"&'Order Form'!$E$5 &\"; Rib: \"&'Order Form'!$E$17 &\"; GT: \"&'Order Form'!$E$16","v":"VIP: ; Rib: No thanks; GT: FREE gift card"},null,null,null,{"$f":"IF(P40=\"\",\"\",IFERROR(INDIRECT(\"Postcodes!$C\"&SUMPRODUCT(--(Postcodes!$A$2:$A$100<=P40)*(Postcodes!$B$2:$B$100>=P40), ROW(Postcodes!$A$2:$A$100))),\"WRONG CODE\"))","v":0},null,null,null,null,null,null,""]
[{"$f":"'Order Form'!A61","v":40},{"$f":"'Order Form'!M61","v":""},{"$f":"'Order Form'!$E$4","v":0},{"$f":"'Order Form'!$E$5","v":0},{"$f":"'Order Form'!$E$6","v":0},{"$f":"'Order Form'!$E$7","v":0},{"$f":"'Order Form'!$E$9","v":0},{"$f":"'Order Form'!$E$8","v":0},{"$f":"'Order Form'!$E$10","v":0},{"$f":"'Order Form'!$E$11","v":0},{"$f":"IF(('Order Form'!$E$15=\"YES\"),'Order Form'!$E$12,\"\")","v":0},{"$f":"'Order Form'!$E$13 & \"\"","v":""},{"$f":"IF('Order Form'!D61=\"\",'Order Form'!C61,'Order Form'!D61) & \"\"","v":""},{"$f":"'Order Form'!E61 & \"\"","v":""},{"$f":"'Order Form'!F61","v":0},{"$f":"'Order Form'!I61","v":0},{"$f":"'Order Form'!G61","v":0},{"$f":"'Order Form'!H61","v":0},{"$f":"'Order Form'!J61 & \"\"","v":""},{"$f":"'Order Form'!L61 & \"\"","v":""},{"$f":"'Order Form'!C61 & \"\"","v":""},{"$f":"'Order Form'!K61 & \"\"","v":""},{"$f":"'Order Form'!$E$14","v":"YES"},{"$f":"'Order Form'!$E$19","v":0},{"$f":"'Order Form'!$E$16","v":"FREE gift card"},{"$f":"'Order Form'!$E$17","v":"No thanks"},"No","No",{"$f":"\"Dispatch Week: \"&'Order Form'!$E$18","v":"Dispatch Week: "},{"$f":"\"VIP: \"&'Order Form'!$E$5 &\"; Rib: \"&'Order Form'!$E$17 &\"; GT: \"&'Order Form'!$E$16","v":"VIP: ; Rib: No thanks; GT: FREE gift card"},null,null,null,{"$f":"IF(P41=\"\",\"\",IFERROR(INDIRECT(\"Postcodes!$C\"&SUMPRODUCT(--(Postcodes!$A$2:$A$100<=P41)*(Postcodes!$B$2:$B$100>=P41), ROW(Postcodes!$A$2:$A$100))),\"WRONG CODE\"))","v":0},null,null,null,null,null,null,""]
[{"$f":"'Order Form'!A62","v":41},{"$f":"'Order Form'!M62","v":""},{"$f":"'Order Form'!$E$4","v":0},{"$f":"'Order Form'!$E$5","v":0},{"$f":"'Order Form'!$E$6","v":0},{"$f":"'Order Form'!$E$7","v":0},{"$f":"'Order Form'!$E$9","v":0},{"$f":"'Order Form'!$E$8","v":0},{"$f":"'Order Form'!$E$10","v":0},{"$f":"'Order Form'!$E$11","v":0},{"$f":"IF(('Order Form'!$E$15=\"YES\"),'Order Form'!$E$12,\"\")","v":0},{"$f":"'Order Form'!$E$13 & \"\"","v":""},{"$f":"IF('Order Form'!D62=\"\",'Order Form'!C62,'Order Form'!D62) & \"\"","v":""},{"$f":"'Order Form'!E62 & \"\"","v":""},{"$f":"'Order Form'!F62","v":0},{"$f":"'Order Form'!I62","v":0},{"$f":"'Order Form'!G62","v":0},{"$f":"'Order Form'!H62","v":0},{"$f":"'Order Form'!J62 & \"\"","v":""},{"$f":"'Order Form'!L62 & \"\"","v":""},{"$f":"'Order Form'!C62 & \"\"","v":""},{"$f":"'Order Form'!K62 & \"\"","v":""},{"$f":"'Order Form'!$E$14","v":"YES"},{"$f":"'Order Form'!$E$19","v":0},{"$f":"'Order Form'!$E$16","v":"FREE gift card"},{"$f":"'Order Form'!$E$17","v":"No thanks"},"No","No",{"$f":"\"Dispatch Week: \"&'Order Form'!$E$18","v":"Dispatch Week: "},{"$f":"\"VIP: \"&'Order Form'!$E$5 &\"; Rib: \"&'Order Form'!$E$17 &\"; GT: \"&'Order Form'!$E$16","v":"VIP: ; Rib: No thanks; GT: FREE gift card"},null,null,null,{"$f":"IF(P42=\"\",\"\",IFERROR(INDIRECT(\"Postcodes!$C\"&SUMPRODUCT(--(Postcodes!$A$2:$A$100<=P42)*(Postcodes!$B$2:$B$100>=P42), ROW(Postcodes!$A$2:$A$100))),\"WRONG CODE\"))","v":0},null,null,null,null,null,null,""]
[{"$f":"'Order Form'!A63","v":42},{"$f":"'Order Form'!M63","v":""},{"$f":"'Order Form'!$E$4","v":0},{"$f":"'Order Form'!$E$5","v":0},{"$f":"'Order Form'!$E$6","v":0},{"$f":"'Order Form'!$E$7","v":0},{"$f":"'Order Form'!$E$9","v":0},{"$f":"'Order Form'!$E$8","v":0},{"$f":"'Order Form'!$E$10","v":0},{"$f":"'Order Form'!$E$11","v":0},{"$f":"IF(('Order Form'!$E$15=\"YES\"),'Order Form'!$E$12,\"\")","v":0},{"$f":"'Order Form'!$E$13 & \"\"","v":""},{"$f":"IF('Order Form'!D63=\"\",'Order Form'!C63,'Order Form'!D63) & \"\"","v":""},{"$f":"'Order Form'!E63 & \"\"","v":""},{"$f":"'Order Form'!F63","v":0},{"$f":"'Order Form'!I63","v":0},{"$f":"'Order Form'!G63","v":0},{"$f":"'Order Form'!H63","v":0},{"$f":"'Order Form'!J63 & \"\"","v":""},{"$f":"'Order Form'!L63 & \"\"","v":""},{"$f":"'Order Form'!C63 & \"\"","v":""},{"$f":"'Order Form'!K63 & \"\"","v":""},{"$f":"'Order Form'!$E$14","v":"YES"},{"$f":"'Order Form'!$E$19","v":0},{"$f":"'Order Form'!$E$16","v":"FREE gift card"},{"$f":"'Order Form'!$E$17","v":"No thanks"},"No","No",{"$f":"\"Dispatch Week: \"&'Order Form'!$E$18","v":"Dispatch Week: "},{"$f":"\"VIP: \"&'Order Form'!$E$5 &\"; Rib: \"&'Order Form'!$E$17 &\"; GT: \"&'Order Form'!$E$16","v":"VIP: ; Rib: No thanks; GT: FREE gift card"},null,null,null,{"$f":"IF(P43=\"\",\"\",IFERROR(INDIRECT(\"Postcodes!$C\"&SUMPRODUCT(--(Postcodes!$A$2:$A$100<=P43)*(Postcodes!$B$2:$B$100>=P43), ROW(Postcodes!$A$2:$A$100))),\"WRONG CODE\"))","v":0},null,null,null,null,null,null,""]
[{"$f":"'Order Form'!A64","v":43},{"$f":"'Order Form'!M64","v":""},{"$f":"'Order Form'!$E$4","v":0},{"$f":"'Order Form'!$E$5","v":0},{"$f":"'Order Form'!$E$6","v":0},{"$f":"'Order Form'!$E$7","v":0},{"$f":"'Order Form'!$E$9","v":0},{"$f":"'Order Form'!$E$8","v":0},{"$f":"'Order Form'!$E$10","v":0},{"$f":"'Order Form'!$E$11","v":0},{"$f":"IF(('Order Form'!$E$15=\"YES\"),'Order Form'!$E$12,\"\")","v":0},{"$f":"'Order Form'!$E$13 & \"\"","v":""},{"$f":"IF('Order Form'!D64=\"\",'Order Form'!C64,'Order Form'!D64) & \"\"","v":""},{"$f":"'Order Form'!E64 & \"\"","v":""},{"$f":"'Order Form'!F64","v":0},{"$f":"'Order Form'!I64","v":0},{"$f":"'Order Form'!G64","v":0},{"$f":"'Order Form'!H64","v":0},{"$f":"'Order Form'!J64 & \"\"","v":""},{"$f":"'Order Form'!L64 & \"\"","v":""},{"$f":"'Order Form'!C64 & \"\"","v":""},{"$f":"'Order Form'!K64 & \"\"","v":""},{"$f":"'Order Form'!$E$14","v":"YES"},{"$f":"'Order Form'!$E$19","v":0},{"$f":"'Order Form'!$E$16","v":"FREE gift card"},{"$f":"'Order Form'!$E$17","v":"No thanks"},"No","No",{"$f":"\"Dispatch Week: \"&'Order Form'!$E$18","v":"Dispatch Week: "},{"$f":"\"VIP: \"&'Order Form'!$E$5 &\"; Rib: \"&'Order Form'!$E$17 &\"; GT: \"&'Order Form'!$E$16","v":"VIP: ; Rib: No thanks; GT: FREE gift card"},null,null,null,{"$f":"IF(P44=\"\",\"\",IFERROR(INDIRECT(\"Postcodes!$C\"&SUMPRODUCT(--(Postcodes!$A$2:$A$100<=P44)*(Postcodes!$B$2:$B$100>=P44), ROW(Postcodes!$A$2:$A$100))),\"WRONG CODE\"))","v":0},null,null,null,null,null,null,""]
[{"$f":"'Order Form'!A65","v":44},{"$f":"'Order Form'!M65","v":""},{"$f":"'Order Form'!$E$4","v":0},{"$f":"'Order Form'!$E$5","v":0},{"$f":"'Order Form'!$E$6","v":0},{"$f":"'Order Form'!$E$7","v":0},{"$f":"'Order Form'!$E$9","v":0},{"$f":"'Order Form'!$E$8","v":0},{"$f":"'Order Form'!$E$10","v":0},{"$f":"'Order Form'!$E$11","v":0},{"$f":"IF(('Order Form'!$E$15=\"YES\"),'Order Form'!$E$12,\"\")","v":0},{"$f":"'Order Form'!$E$13 & \"\"","v":""},{"$f":"IF('Order Form'!D65=\"\",'Order Form'!C65,'Order Form'!D65) & \"\"","v":""},{"$f":"'Order Form'!E65 & \"\"","v":""},{"$f":"'Order Form'!F65","v":0},{"$f":"'Order Form'!I65","v":0},{"$f":"'Order Form'!G65","v":0},{"$f":"'Order Form'!H65","v":0},{"$f":"'Order Form'!J65 & \"\"","v":""},{"$f":"'Order Form'!L65 & \"\"","v":""},{"$f":"'Order Form'!C65 & \"\"","v":""},{"$f":"'Order Form'!K65 & \"\"","v":""},{"$f":"'Order Form'!$E$14","v":"YES"},{"$f":"'Order Form'!$E$19","v":0},{"$f":"'Order Form'!$E$16","v":"FREE gift card"},{"$f":"'Order Form'!$E$17","v":"No thanks"},"No","No",{"$f":"\"Dispatch Week: \"&'Order Form'!$E$18","v":"Dispatch Week: "},{"$f":"\"VIP: \"&'Order Form'!$E$5 &\"; Rib: \"&'Order Form'!$E$17 &\"; GT: \"&'Order Form'!$E$16","v":"VIP: ; Rib: No thanks; GT: FREE gift card"},null,null,null,{"$f":"IF(P45=\"\",\"\",IFERROR(INDIRECT(\"Postcodes!$C\"&SUMPRODUCT(--(Postcodes!$A$2:$A$100<=P45)*(Postcodes!$B$2:$B$100>=P45), ROW(Postcodes!$A$2:$A$100))),\"WRONG CODE\"))","v":0},null,null,null,null,null,null,""]
[{"$f":"'Order Form'!A66","v":45},{"$f":"'Order Form'!M66","v":""},{"$f":"'Order Form'!$E$4","v":0},{"$f":"'Order Form'!$E$5","v":0},{"$f":"'Order Form'!$E$6","v":0},{"$f":"'Order Form'!$E$7","v":0},{"$f":"'Order Form'!$E$9","v":0},{"$f":"'Order Form'!$E$8","v":0},{"$f":"'Order Form'!$E$10","v":0},{"$f":"'Order Form'!$E$11","v":0},{"$f":"IF(('Order Form'!$E$15=\"YES\"),'Order Form'!$E$12,\"\")","v":0},{"$f":"'Order Form'!$E$13 & \"\"","v":""},{"$f":"IF('Order Form'!D66=\"\",'Order Form'!C66,'Order Form'!D66) & \"\"","v":""},{"$f":"'Order Form'!E66 & \"\"","v":""},{"$f":"'Order Form'!F66","v":0},{"$f":"'Order Form'!I66","v":0},{"$f":"'Order Form'!G66","v":0},{"$f":"'Order Form'!H66","v":0},{"$f":"'Order Form'!J66 & \"\"","v":""},{"$f":"'Order Form'!L66 & \"\"","v":""},{"$f":"'Order Form'!C66 & \"\"","v":""},{"$f":"'Order Form'!K66 & \"\"","v":""},{"$f":"'Order Form'!$E$14","v":"YES"},{"$f":"'Order Form'!$E$19","v":0},{"$f":"'Order Form'!$E$16","v":"FREE gift card"},{"$f":"'Order Form'!$E$17","v":"No thanks"},"No","No",{"$f":"\"Dispatch Week: \"&'Order Form'!$E$18","v":"Dispatch Week: "},{"$f":"\"VIP: \"&'Order Form'!$E$5 &\"; Rib: \"&'Order Form'!$E$17 &\"; GT: \"&'Order Form'!$E$16","v":"VIP: ; Rib: No thanks; GT: FREE gift card"},null,null,null,{"$f":"IF(P46=\"\",\"\",IFERROR(INDIRECT(\"Postcodes!$C\"&SUMPRODUCT(--(Postcodes!$A$2:$A$100<=P46)*(Postcodes!$B$2:$B$100>=P46), ROW(Postcodes!$A$2:$A$100))),\"WRONG CODE\"))","v":0},null,null,null,null,null,null,""]
[{"$f":"'Order Form'!A67","v":46},{"$f":"'Order Form'!M67","v":""},{"$f":"'Order Form'!$E$4","v":0},{"$f":"'Order Form'!$E$5","v":0},{"$f":"'Order Form'!$E$6","v":0},{"$f":"'Order Form'!$E$7","v":0},{"$f":"'Order Form'!$E$9","v":0},{"$f":"'Order Form'!$E$8","v":0},{"$f":"'Order Form'!$E$10","v":0},{"$f":"'Order Form'!$E$11","v":0},{"$f":"IF(('Order Form'!$E$15=\"YES\"),'Order Form'!$E$12,\"\")","v":0},{"$f":"'Order Form'!$E$13 & \"\"","v":""},{"$f":"IF('Order Form'!D67=\"\",'Order Form'!C67,'Order Form'!D67) & \"\"","v":""},{"$f":"'Order Form'!E67 & \"\"","v":""},{"$f":"'Order Form'!F67","v":0},{"$f":"'Order Form'!I67","v":0},{"$f":"'Order Form'!G67","v":0},{"$f":"'Order Form'!H67","v":0},{"$f":"'Order Form'!J67 & \"\"","v":""},{"$f":"'Order Form'!L67 & \"\"","v":""},{"$f":"'Order Form'!C67 & \"\"","v":""},{"$f":"'Order Form'!K67 & \"\"","v":""},{"$f":"'Order Form'!$E$14","v":"YES"},{"$f":"'Order Form'!$E$19","v":0},{"$f":"'Order Form'!$E$16","v":"FREE gift card"},{"$f":"'Order Form'!$E$17","v":"No thanks"},"No","No",{"$f":"\"Dispatch Week: \"&'Order Form'!$E$18","v":"Dispatch Week: "},{"$f":"\"VIP: \"&'Order Form'!$E$5 &\"; Rib: \"&'Order Form'!$E$17 &\"; GT: \"&'Order Form'!$E$16","v":"VIP: ; Rib: No thanks; GT: FREE gift card"},null,null,null,{"$f":"IF(P47=\"\",\"\",IFERROR(INDIRECT(\"Postcodes!$C\"&SUMPRODUCT(--(Postcodes!$A$2:$A$100<=P47)*(Postcodes!$B$2:$B$100>=P47), ROW(Postcodes!$A$2:$A$100))),\"WRONG CODE\"))","v":0},null,null,null,null,null,null,""]
[{"$f":"'Order Form'!A68","v":47},{"$f":"'Order Form'!M68","v":""},{"$f":"'Order Form'!$E$4","v":0},{"$f":"'Order Form'!$E$5","v":0},{"$f":"'Order Form'!$E$6","v":0},{"$f":"'Order Form'!$E$7","v":0},{"$f":"'Order Form'!$E$9","v":0},{"$f":"'Order Form'!$E$8","v":0},{"$f":"'Order Form'!$E$10","v":0},{"$f":"'Order Form'!$E$11","v":0},{"$f":"IF(('Order Form'!$E$15=\"YES\"),'Order Form'!$E$12,\"\")","v":0},{"$f":"'Order Form'!$E$13 & \"\"","v":""},{"$f":"IF('Order Form'!D68=\"\",'Order Form'!C68,'Order Form'!D68) & \"\"","v":""},{"$f":"'Order Form'!E68 & \"\"","v":""},{"$f":"'Order Form'!F68","v":0},{"$f":"'Order Form'!I68","v":0},{"$f":"'Order Form'!G68","v":0},{"$f":"'Order Form'!H68","v":0},{"$f":"'Order Form'!J68 & \"\"","v":""},{"$f":"'Order Form'!L68 & \"\"","v":""},{"$f":"'Order Form'!C68 & \"\"","v":""},{"$f":"'Order Form'!K68 & \"\"","v":""},{"$f":"'Order Form'!$E$14","v":"YES"},{"$f":"'Order Form'!$E$19","v":0},{"$f":"'Order Form'!$E$16","v":"FREE gift card"},{"$f":"'Order Form'!$E$17","v":"No thanks"},"No","No",{"$f":"\"Dispatch Week: \"&'Order Form'!$E$18","v":"Dispatch Week: "},{"$f":"\"VIP: \"&'Order Form'!$E$5 &\"; Rib: \"&'Order Form'!$E$17 &\"; GT: \"&'Order Form'!$E$16","v":"VIP: ; Rib: No thanks; GT: FREE gift card"},null,null,null,{"$f":"IF(P48=\"\",\"\",IFERROR(INDIRECT(\"Postcodes!$C\"&SUMPRODUCT(--(Postcodes!$A$2:$A$100<=P48)*(Postcodes!$B$2:$B$100>=P48), ROW(Postcodes!$A$2:$A$100))),\"WRONG CODE\"))","v":0},null,null,null,null,null,null,""]
[{"$f":"'Order Form'!A69","v":48},{"$f":"'Order Form'!M69","v":""},{"$f":"'Order Form'!$E$4","v":0},{"$f":"'Order Form'!$E$5","v":0},{"$f":"'Order Form'!$E$6","v":0},{"$f":"'Order Form'!$E$7","v":0},{"$f":"'Order Form'!$E$9","v":0},{"$f":"'Order Form'!$E$8","v":0},{"$f":"'Order Form'!$E$10","v":0},{"$f":"'Order Form'!$E$11","v":0},{"$f":"IF(('Order Form'!$E$15=\"YES\"),'Order Form'!$E$12,\"\")","v":0},{"$f":"'Order Form'!$E$13 & \"\"","v":""},{"$f":"IF('Order Form'!D69=\"\",'Order Form'!C69,'Order Form'!D69) & \"\"","v":""},{"$f":"'Order Form'!E69 & \"\"","v":""},{"$f":"'Order Form'!F69","v":0},{"$f":"'Order Form'!I69","v":0},{"$f":"'Order Form'!G69","v":0},{"$f":"'Order Form'!H69","v":0},{"$f":"'Order Form'!J69 & \"\"","v":""},{"$f":"'Order Form'!L69 & \"\"","v":""},{"$f":"'Order Form'!C69 & \"\"","v":""},{"$f":"'Order Form'!K69 & \"\"","v":""},{"$f":"'Order Form'!$E$14","v":"YES"},{"$f":"'Order Form'!$E$19","v":0},{"$f":"'Order Form'!$E$16","v":"FREE gift card"},{"$f":"'Order Form'!$E$17","v":"No thanks"},"No","No",{"$f":"\"Dispatch Week: \"&'Order Form'!$E$18","v":"Dispatch Week: "},{"$f":"\"VIP: \"&'Order Form'!$E$5 &\"; Rib: \"&'Order Form'!$E$17 &\"; GT: \"&'Order Form'!$E$16","v":"VIP: ; Rib: No thanks; GT: FREE gift card"},null,null,null,{"$f":"IF(P49=\"\",\"\",IFERROR(INDIRECT(\"Postcodes!$C\"&SUMPRODUCT(--(Postcodes!$A$2:$A$100<=P49)*(Postcodes!$B$2:$B$100>=P49), ROW(Postcodes!$A$2:$A$100))),\"WRONG CODE\"))","v":0},null,null,null,null,null,null,""]
[{"$f":"'Order Form'!A70","v":49},{"$f":"'Order Form'!M70","v":""},{"$f":"'Order Form'!$E$4","v":0},{"$f":"'Order Form'!$E$5","v":0},{"$f":"'Order Form'!$E$6","v":0},{"$f":"'Order Form'!$E$7","v":0},{"$f":"'Order Form'!$E$9","v":0},{"$f":"'Order Form'!$E$8","v":0},{"$f":"'Order Form'!$E$10","v":0},{"$f":"'Order Form'!$E$11","v":0},{"$f":"IF(('Order Form'!$E$15=\"YES\"),'Order Form'!$E$12,\"\")","v":0},{"$f":"'Order Form'!$E$13 & \"\"","v":""},{"$f":"IF('Order Form'!D70=\"\",'Order Form'!C70,'Order Form'!D70) & \"\"","v":""},{"$f":"'Order Form'!E70 & \"\"","v":""},{"$f":"'Order Form'!F70","v":0},{"$f":"'Order Form'!I70","v":0},{"$f":"'Order Form'!G70","v":0},{"$f":"'Order Form'!H70","v":0},{"$f":"'Order Form'!J70 & \"\"","v":""},{"$f":"'Order Form'!L70 & \"\"","v":""},{"$f":"'Order Form'!C70 & \"\"","v":""},{"$f":"'Order Form'!K70 & \"\"","v":""},{"$f":"'Order Form'!$E$14","v":"YES"},{"$f":"'Order Form'!$E$19","v":0},{"$f":"'Order Form'!$E$16","v":"FREE gift card"},{"$f":"'Order Form'!$E$17","v":"No thanks"},"No","No",{"$f":"\"Dispatch Week: \"&'Order Form'!$E$18","v":"Dispatch Week: "},{"$f":"\"VIP: \"&'Order Form'!$E$5 &\"; Rib: \"&'Order Form'!$E$17 &\"; GT: \"&'Order Form'!$E$16","v":"VIP: ; Rib: No thanks; GT: FREE gift card"},null,null,null,{"$f":"IF(P50=\"\",\"\",IFERROR(INDIRECT(\"Postcodes!$C\"&SUMPRODUCT(--(Postcodes!$A$2:$A$100<=P50)*(Postcodes!$B$2:$B$100>=P50), ROW(Postcodes!$A$2:$A$100))),\"WRONG CODE\"))","v":0},null,null,null,null,null,null,""]
[{"$f":"'Order Form'!A71","v":50},{"$f":"'Order Form'!M71","v":""},{"$f":"'Order Form'!$E$4","v":0},{"$f":"'Order Form'!$E$5","v":0},{"$f":"'Order Form'!$E$6","v":0},{"$f":"'Order Form'!$E$7","v":0},{"$f":"'Order Form'!$E$9","v":0},{"$f":"'Order Form'!$E$8","v":0},{"$f":"'Order Form'!$E$10","v":0},{"$f":"'Order Form'!$E$11","v":0},{"$f":"IF(('Order Form'!$E$15=\"YES\"),'Order Form'!$E$12,\"\")","v":0},{"$f":"'Order Form'!$E$13 & \"\"","v":""},{"$f":"IF('Order Form'!D71=\"\",'Order Form'!C71,'Order Form'!D71) & \"\"","v":""},{"$f":"'Order Form'!E71 & \"\"","v":""},{"$f":"'Order Form'!F71","v":0},{"$f":"'Order Form'!I71","v":0},{"$f":"'Order Form'!G71","v":0},{"$f":"'Order Form'!H71","v":0},{"$f":"'Order Form'!J71 & \"\"","v":""},{"$f":"'Order Form'!L71 & \"\"","v":""},{"$f":"'Order Form'!C71 & \"\"","v":""},{"$f":"'Order Form'!K71 & \"\"","v":""},{"$f":"'Order Form'!$E$14","v":"YES"},{"$f":"'Order Form'!$E$19","v":0},{"$f":"'Order Form'!$E$16","v":"FREE gift card"},{"$f":"'Order Form'!$E$17","v":"No thanks"},"No","No",{"$f":"\"Dispatch Week: \"&'Order Form'!$E$18","v":"Dispatch Week: "},{"$f":"\"VIP: \"&'Order Form'!$E$5 &\"; Rib: \"&'Order Form'!$E$17 &\"; GT: \"&'Order Form'!$E$16","v":"VIP: ; Rib: No thanks; GT: FREE gift card"},null,null,null,{"$f":"IF(P51=\"\",\"\",IFERROR(INDIRECT(\"Postcodes!$C\"&SUMPRODUCT(--(Postcodes!$A$2:$A$100<=P51)*(Postcodes!$B$2:$B$100>=P51), ROW(Postcodes!$A$2:$A$100))),\"WRONG CODE\"))","v":0},null,null,null,null,null,null,""]
[{"$f":"'Order Form'!A72","v":51},{"$f":"'Order Form'!M72","v":""},{"$f":"'Order Form'!$E$4","v":0},{"$f":"'Order Form'!$E$5","v":0},{"$f":"'Order Form'!$E$6","v":0},{"$f":"'Order Form'!$E$7","v":0},{"$f":"'Order Form'!$E$9","v":0},{"$f":"'Order Form'!$E$8","v":0},{"$f":"'Order Form'!$E$10","v":0},{"$f":"'Order Form'!$E$11","v":0},{"$f":"IF(('Order Form'!$E$15=\"YES\"),'Order Form'!$E$12,\"\")","v":0},{"$f":"'Order Form'!$E$13 & \"\"","v":""},{"$f":"IF('Order Form'!D72=\"\",'Order Form'!C72,'Order Form'!D72) & \"\"","v":""},{"$f":"'Order Form'!E72 & \"\"","v":""},{"$f":"'Order Form'!F72","v":0},{"$f":"'Order Form'!I72","v":0},{"$f":"'Order Form'!G72","v":0},{"$f":"'Order Form'!H72","v":0},{"$f":"'Order Form'!J72 & \"\"","v":""},{"$f":"'Order Form'!L72 & \"\"","v":""},{"$f":"'Order Form'!C72 & \"\"","v":""},{"$f":"'Order Form'!K72 & \"\"","v":""},{"$f":"'Order Form'!$E$14","v":"YES"},{"$f":"'Order Form'!$E$19","v":0},{"$f":"'Order Form'!$E$16","v":"FREE gift card"},{"$f":"'Order Form'!$E$17","v":"No thanks"},"No","No",{"$f":"\"Dispatch Week: \"&'Order Form'!$E$18","v":"Dispatch Week: "},{"$f":"\"VIP: \"&'Order Form'!$E$5 &\"; Rib: \"&'Order Form'!$E$17 &\"; GT: \"&'Order Form'!$E$16","v":"VIP: ; Rib: No thanks; GT: FREE gift card"},null,null,null,{"$f":"IF(P52=\"\",\"\",IFERROR(INDIRECT(\"Postcodes!$C\"&SUMPRODUCT(--(Postcodes!$A$2:$A$100<=P52)*(Postcodes!$B$2:$B$100>=P52), ROW(Postcodes!$A$2:$A$100))),\"WRONG CODE\"))","v":0},null,null,null,null,null,null,""]
[{"$f":"'Order Form'!A73","v":52},{"$f":"'Order Form'!M73","v":""},{"$f":"'Order Form'!$E$4","v":0},{"$f":"'Order Form'!$E$5","v":0},{"$f":"'Order Form'!$E$6","v":0},{"$f":"'Order Form'!$E$7","v":0},{"$f":"'Order Form'!$E$9","v":0},{"$f":"'Order Form'!$E$8","v":0},{"$f":"'Order Form'!$E$10","v":0},{"$f":"'Order Form'!$E$11","v":0},{"$f":"IF(('Order Form'!$E$15=\"YES\"),'Order Form'!$E$12,\"\")","v":0},{"$f":"'Order Form'!$E$13 & \"\"","v":""},{"$f":"IF('Order Form'!D73=\"\",'Order Form'!C73,'Order Form'!D73) & \"\"","v":""},{"$f":"'Order Form'!E73 & \"\"","v":""},{"$f":"'Order Form'!F73","v":0},{"$f":"'Order Form'!I73","v":0},{"$f":"'Order Form'!G73","v":0},{"$f":"'Order Form'!H73","v":0},{"$f":"'Order Form'!J73 & \"\"","v":""},{"$f":"'Order Form'!L73 & \"\"","v":""},{"$f":"'Order Form'!C73 & \"\"","v":""},{"$f":"'Order Form'!K73 & \"\"","v":""},{"$f":"'Order Form'!$E$14","v":"YES"},{"$f":"'Order Form'!$E$19","v":0},{"$f":"'Order Form'!$E$16","v":"FREE gift card"},{"$f":"'Order Form'!$E$17","v":"No thanks"},"No","No",{"$f":"\"Dispatch Week: \"&'Order Form'!$E$18","v":"Dispatch Week: "},{"$f":"\"VIP: \"&'Order Form'!$E$5 &\"; Rib: \"&'Order Form'!$E$17 &\"; GT: \"&'Order Form'!$E$16","v":"VIP: ; Rib: No thanks; GT: FREE gift card"},null,null,null,{"$f":"IF(P53=\"\",\"\",IFERROR(INDIRECT(\"Postcodes!$C\"&SUMPRODUCT(--(Postcodes!$A$2:$A$100<=P53)*(Postcodes!$B$2:$B$100>=P53), ROW(Postcodes!$A$2:$A$100))),\"WRONG CODE\"))","v":0},null,null,null,null,null,null,""]
[{"$f":"'Order Form'!A74","v":53},{"$f":"'Order Form'!M74","v":""},{"$f":"'Order Form'!$E$4","v":0},{"$f":"'Order Form'!$E$5","v":0},{"$f":"'Order Form'!$E$6","v":0},{"$f":"'Order Form'!$E$7","v":0},{"$f":"'Order Form'!$E$9","v":0},{"$f":"'Order Form'!$E$8","v":0},{"$f":"'Order Form'!$E$10","v":0},{"$f":"'Order Form'!$E$11","v":0},{"$f":"IF(('Order Form'!$E$15=\"YES\"),'Order Form'!$E$12,\"\")","v":0},{"$f":"'Order Form'!$E$13 & \"\"","v":""},{"$f":"IF('Order Form'!D74=\"\",'Order Form'!C74,'Order Form'!D74) & \"\"","v":""},{"$f":"'Order Form'!E74 & \"\"","v":""},{"$f":"'Order Form'!F74","v":0},{"$f":"'Order Form'!I74","v":0},{"$f":"'Order Form'!G74","v":0},{"$f":"'Order Form'!H74","v":0},{"$f":"'Order Form'!J74 & \"\"","v":""},{"$f":"'Order Form'!L74 & \"\"","v":""},{"$f":"'Order Form'!C74 & \"\"","v":""},{"$f":"'Order Form'!K74 & \"\"","v":""},{"$f":"'Order Form'!$E$14","v":"YES"},{"$f":"'Order Form'!$E$19","v":0},{"$f":"'Order Form'!$E$16","v":"FREE gift card"},{"$f":"'Order Form'!$E$17","v":"No thanks"},"No","No",{"$f":"\"Dispatch Week: \"&'Order Form'!$E$18","v":"Dispatch Week: "},{"$f":"\"VIP: \"&'Order Form'!$E$5 &\"; Rib: \"&'Order Form'!$E$17 &\"; GT: \"&'Order Form'!$E$16","v":"VIP: ; Rib: No thanks; GT: FREE gift card"},null,null,null,{"$f":"IF(P54=\"\",\"\",IFERROR(INDIRECT(\"Postcodes!$C\"&SUMPRODUCT(--(Postcodes!$A$2:$A$100<=P54)*(Postcodes!$B$2:$B$100>=P54), ROW(Postcodes!$A$2:$A$100))),\"WRONG CODE\"))","v":0},null,null,null,null,null,null,""]
[{"$f":"'Order Form'!A75","v":54},{"$f":"'Order Form'!M75","v":""},{"$f":"'Order Form'!$E$4","v":0},{"$f":"'Order Form'!$E$5","v":0},{"$f":"'Order Form'!$E$6","v":0},{"$f":"'Order Form'!$E$7","v":0},{"$f":"'Order Form'!$E$9","v":0},{"$f":"'Order Form'!$E$8","v":0},{"$f":"'Order Form'!$E$10","v":0},{"$f":"'Order Form'!$E$11","v":0},{"$f":"IF(('Order Form'!$E$15=\"YES\"),'Order Form'!$E$12,\"\")","v":0},{"$f":"'Order Form'!$E$13 & \"\"","v":""},{"$f":"IF('Order Form'!D75=\"\",'Order Form'!C75,'Order Form'!D75) & \"\"","v":""},{"$f":"'Order Form'!E75 & \"\"","v":""},{"$f":"'Order Form'!F75","v":0},{"$f":"'Order Form'!I75","v":0},{"$f":"'Order Form'!G75","v":0},{"$f":"'Order Form'!H75","v":0},{"$f":"'Order Form'!J75 & \"\"","v":""},{"$f":"'Order Form'!L75 & \"\"","v":""},{"$f":"'Order Form'!C75 & \"\"","v":""},{"$f":"'Order Form'!K75 & \"\"","v":""},{"$f":"'Order Form'!$E$14","v":"YES"},{"$f":"'Order Form'!$E$19","v":0},{"$f":"'Order Form'!$E$16","v":"FREE gift card"},{"$f":"'Order Form'!$E$17","v":"No thanks"},"No","No",{"$f":"\"Dispatch Week: \"&'Order Form'!$E$18","v":"Dispatch Week: "},{"$f":"\"VIP: \"&'Order Form'!$E$5 &\"; Rib: \"&'Order Form'!$E$17 &\"; GT: \"&'Order Form'!$E$16","v":"VIP: ; Rib: No thanks; GT: FREE gift card"},null,null,null,{"$f":"IF(P55=\"\",\"\",IFERROR(INDIRECT(\"Postcodes!$C\"&SUMPRODUCT(--(Postcodes!$A$2:$A$100<=P55)*(Postcodes!$B$2:$B$100>=P55), ROW(Postcodes!$A$2:$A$100))),\"WRONG CODE\"))","v":0},null,null,null,null,null,null,""]
[{"$f":"'Order Form'!A76","v":55},{"$f":"'Order Form'!M76","v":""},{"$f":"'Order Form'!$E$4","v":0},{"$f":"'Order Form'!$E$5","v":0},{"$f":"'Order Form'!$E$6","v":0},{"$f":"'Order Form'!$E$7","v":0},{"$f":"'Order Form'!$E$9","v":0},{"$f":"'Order Form'!$E$8","v":0},{"$f":"'Order Form'!$E$10","v":0},{"$f":"'Order Form'!$E$11","v":0},{"$f":"IF(('Order Form'!$E$15=\"YES\"),'Order Form'!$E$12,\"\")","v":0},{"$f":"'Order Form'!$E$13 & \"\"","v":""},{"$f":"IF('Order Form'!D76=\"\",'Order Form'!C76,'Order Form'!D76) & \"\"","v":""},{"$f":"'Order Form'!E76 & \"\"","v":""},{"$f":"'Order Form'!F76","v":0},{"$f":"'Order Form'!I76","v":0},{"$f":"'Order Form'!G76","v":0},{"$f":"'Order Form'!H76","v":0},{"$f":"'Order Form'!J76 & \"\"","v":""},{"$f":"'Order Form'!L76 & \"\"","v":""},{"$f":"'Order Form'!C76 & \"\"","v":""},{"$f":"'Order Form'!K76 & \"\"","v":""},{"$f":"'Order Form'!$E$14","v":"YES"},{"$f":"'Order Form'!$E$19","v":0},{"$f":"'Order Form'!$E$16","v":"FREE gift card"},{"$f":"'Order Form'!$E$17","v":"No thanks"},"No","No",{"$f":"\"Dispatch Week: \"&'Order Form'!$E$18","v":"Dispatch Week: "},{"$f":"\"VIP: \"&'Order Form'!$E$5 &\"; Rib: \"&'Order Form'!$E$17 &\"; GT: \"&'Order Form'!$E$16","v":"VIP: ; Rib: No thanks; GT: FREE gift card"},null,null,null,{"$f":"IF(P56=\"\",\"\",IFERROR(INDIRECT(\"Postcodes!$C\"&SUMPRODUCT(--(Postcodes!$A$2:$A$100<=P56)*(Postcodes!$B$2:$B$100>=P56), ROW(Postcodes!$A$2:$A$100))),\"WRONG CODE\"))","v":0},null,null,null,null,null,null,""]
[{"$f":"'Order Form'!A77","v":56},{"$f":"'Order Form'!M77","v":""},{"$f":"'Order Form'!$E$4","v":0},{"$f":"'Order Form'!$E$5","v":0},{"$f":"'Order Form'!$E$6","v":0},{"$f":"'Order Form'!$E$7","v":0},{"$f":"'Order Form'!$E$9","v":0},{"$f":"'Order Form'!$E$8","v":0},{"$f":"'Order Form'!$E$10","v":0},{"$f":"'Order Form'!$E$11","v":0},{"$f":"IF(('Order Form'!$E$15=\"YES\"),'Order Form'!$E$12,\"\")","v":0},{"$f":"'Order Form'!$E$13 & \"\"","v":""},{"$f":"IF('Order Form'!D77=\"\",'Order Form'!C77,'Order Form'!D77) & \"\"","v":""},{"$f":"'Order Form'!E77 & \"\"","v":""},{"$f":"'Order Form'!F77","v":0},{"$f":"'Order Form'!I77","v":0},{"$f":"'Order Form'!G77","v":0},{"$f":"'Order Form'!H77","v":0},{"$f":"'Order Form'!J77 & \"\"","v":""},{"$f":"'Order Form'!L77 & \"\"","v":""},{"$f":"'Order Form'!C77 & \"\"","v":""},{"$f":"'Order Form'!K77 & \"\"","v":""},{"$f":"'Order Form'!$E$14","v":"YES"},{"$f":"'Order Form'!$E$19","v":0},{"$f":"'Order Form'!$E$16","v":"FREE gift card"},{"$f":"'Order Form'!$E$17","v":"No thanks"},"No","No",{"$f":"\"Dispatch Week: \"&'Order Form'!$E$18","v":"Dispatch Week: "},{"$f":"\"VIP: \"&'Order Form'!$E$5 &\"; Rib: \"&'Order Form'!$E$17 &\"; GT: \"&'Order Form'!$E$16","v":"VIP: ; Rib: No thanks; GT: FREE gift card"},null,null,null,{"$f":"IF(P57=\"\",\"\",IFERROR(INDIRECT(\"Postcodes!$C\"&SUMPRODUCT(--(Postcodes!$A$2:$A$100<=P57)*(Postcodes!$B$2:$B$100>=P57), ROW(Postcodes!$A$2:$A$100))),\"WRONG CODE\"))","v":0},null,null,null,null,null,null,""]
[{"$f":"'Order Form'!A78","v":57},{"$f":"'Order Form'!M78","v":""},{"$f":"'Order Form'!$E$4","v":0},{"$f":"'Order Form'!$E$5","v":0},{"$f":"'Order Form'!$E$6","v":0},{"$f":"'Order Form'!$E$7","v":0},{"$f":"'Order Form'!$E$9","v":0},{"$f":"'Order Form'!$E$8","v":0},{"$f":"'Order Form'!$E$10","v":0},{"$f":"'Order Form'!$E$11","v":0},{"$f":"IF(('Order Form'!$E$15=\"YES\"),'Order Form'!$E$12,\"\")","v":0},{"$f":"'Order Form'!$E$13 & \"\"","v":""},{"$f":"IF('Order Form'!D78=\"\",'Order Form'!C78,'Order Form'!D78) & \"\"","v":""},{"$f":"'Order Form'!E78 & \"\"","v":""},{"$f":"'Order Form'!F78","v":0},{"$f":"'Order Form'!I78","v":0},{"$f":"'Order Form'!G78","v":0},{"$f":"'Order Form'!H78","v":0},{"$f":"'Order Form'!J78 & \"\"","v":""},{"$f":"'Order Form'!L78 & \"\"","v":""},{"$f":"'Order Form'!C78 & \"\"","v":""},{"$f":"'Order Form'!K78 & \"\"","v":""},{"$f":"'Order Form'!$E$14","v":"YES"},{"$f":"'Order Form'!$E$19","v":0},{"$f":"'Order Form'!$E$16","v":"FREE gift card"},{"$f":"'Order Form'!$E$17","v":"No thanks"},"No","No",{"$f":"\"Dispatch Week: \"&'Order Form'!$E$18","v":"Dispatch Week: "},{"$f":"\"VIP: \"&'Order Form'!$E$5 &\"; Rib: \"&'Order Form'!$E$17 &\"; GT: \"&'Order Form'!$E$16","v":"VIP: ; Rib: No thanks; GT: FREE gift card"},null,null,null,{"$f":"IF(P58=\"\",\"\",IFERROR(INDIRECT(\"Postcodes!$C\"&SUMPRODUCT(--(Postcodes!$A$2:$A$100<=P58)*(Postcodes!$B$2:$B$100>=P58), ROW(Postcodes!$A$2:$A$100))),\"WRONG CODE\"))","v":0},null,null,null,null,null,null,""]
[{"$f":"'Order Form'!A79","v":58},{"$f":"'Order Form'!M79","v":""},{"$f":"'Order Form'!$E$4","v":0},{"$f":"'Order Form'!$E$5","v":0},{"$f":"'Order Form'!$E$6","v":0},{"$f":"'Order Form'!$E$7","v":0},{"$f":"'Order Form'!$E$9","v":0},{"$f":"'Order Form'!$E$8","v":0},{"$f":"'Order Form'!$E$10","v":0},{"$f":"'Order Form'!$E$11","v":0},{"$f":"IF(('Order Form'!$E$15=\"YES\"),'Order Form'!$E$12,\"\")","v":0},{"$f":"'Order Form'!$E$13 & \"\"","v":""},{"$f":"IF('Order Form'!D79=\"\",'Order Form'!C79,'Order Form'!D79) & \"\"","v":""},{"$f":"'Order Form'!E79 & \"\"","v":""},{"$f":"'Order Form'!F79","v":0},{"$f":"'Order Form'!I79","v":0},{"$f":"'Order Form'!G79","v":0},{"$f":"'Order Form'!H79","v":0},{"$f":"'Order Form'!J79 & \"\"","v":""},{"$f":"'Order Form'!L79 & \"\"","v":""},{"$f":"'Order Form'!C79 & \"\"","v":""},{"$f":"'Order Form'!K79 & \"\"","v":""},{"$f":"'Order Form'!$E$14","v":"YES"},{"$f":"'Order Form'!$E$19","v":0},{"$f":"'Order Form'!$E$16","v":"FREE gift card"},{"$f":"'Order Form'!$E$17","v":"No thanks"},"No","No",{"$f":"\"Dispatch Week: \"&'Order Form'!$E$18","v":"Dispatch Week: "},{"$f":"\"VIP: \"&'Order Form'!$E$5 &\"; Rib: \"&'Order Form'!$E$17 &\"; GT: \"&'Order Form'!$E$16","v":"VIP: ; Rib: No thanks; GT: FREE gift card"},null,null,null,{"$f":"IF(P59=\"\",\"\",IFERROR(INDIRECT(\"Postcodes!$C\"&SUMPRODUCT(--(Postcodes!$A$2:$A$100<=P59)*(Postcodes!$B$2:$B$100>=P59), ROW(Postcodes!$A$2:$A$100))),\"WRONG CODE\"))","v":0},null,null,null,null,null,null,""]
[{"$f":"'Order Form'!A80","v":59},{"$f":"'Order Form'!M80","v":""},{"$f":"'Order Form'!$E$4","v":0},{"$f":"'Order Form'!$E$5","v":0},{"$f":"'Order Form'!$E$6","v":0},{"$f":"'Order Form'!$E$7","v":0},{"$f":"'Order Form'!$E$9","v":0},{"$f":"'Order Form'!$E$8","v":0},{"$f":"'Order Form'!$E$10","v":0},{"$f":"'Order Form'!$E$11","v":0},{"$f":"IF(('Order Form'!$E$15=\"YES\"),'Order Form'!$E$12,\"\")","v":0},{"$f":"'Order Form'!$E$13 & \"\"","v":""},{"$f":"IF('Order Form'!D80=\"\",'Order Form'!C80,'Order Form'!D80) & \"\"","v":""},{"$f":"'Order Form'!E80 & \"\"","v":""},{"$f":"'Order Form'!F80","v":0},{"$f":"'Order Form'!I80","v":0},{"$f":"'Order Form'!G80","v":0},{"$f":"'Order Form'!H80","v":0},{"$f":"'Order Form'!J80 & \"\"","v":""},{"$f":"'Order Form'!L80 & \"\"","v":""},{"$f":"'Order Form'!C80 & \"\"","v":""},{"$f":"'Order Form'!K80 & \"\"","v":""},{"$f":"'Order Form'!$E$14","v":"YES"},{"$f":"'Order Form'!$E$19","v":0},{"$f":"'Order Form'!$E$16","v":"FREE gift card"},{"$f":"'Order Form'!$E$17","v":"No thanks"},"No","No",{"$f":"\"Dispatch Week: \"&'Order Form'!$E$18","v":"Dispatch Week: "},{"$f":"\"VIP: \"&'Order Form'!$E$5 &\"; Rib: \"&'Order Form'!$E$17 &\"; GT: \"&'Order Form'!$E$16","v":"VIP: ; Rib: No thanks; GT: FREE gift card"},null,null,null,{"$f":"IF(P60=\"\",\"\",IFERROR(INDIRECT(\"Postcodes!$C\"&SUMPRODUCT(--(Postcodes!$A$2:$A$100<=P60)*(Postcodes!$B$2:$B$100>=P60), ROW(Postcodes!$A$2:$A$100))),\"WRONG CODE\"))","v":0},null,null,null,null,null,null,""]
[{"$f":"'Order Form'!A81","v":60},{"$f":"'Order Form'!M81","v":""},{"$f":"'Order Form'!$E$4","v":0},{"$f":"'Order Form'!$E$5","v":0},{"$f":"'Order Form'!$E$6","v":0},{"$f":"'Order Form'!$E$7","v":0},{"$f":"'Order Form'!$E$9","v":0},{"$f":"'Order Form'!$E$8","v":0},{"$f":"'Order Form'!$E$10","v":0},{"$f":"'Order Form'!$E$11","v":0},{"$f":"IF(('Order Form'!$E$15=\"YES\"),'Order Form'!$E$12,\"\")","v":0},{"$f":"'Order Form'!$E$13 & \"\"","v":""},{"$f":"IF('Order Form'!D81=\"\",'Order Form'!C81,'Order Form'!D81) & \"\"","v":""},{"$f":"'Order Form'!E81 & \"\"","v":""},{"$f":"'Order Form'!F81","v":0},{"$f":"'Order Form'!I81","v":0},{"$f":"'Order Form'!G81","v":0},{"$f":"'Order Form'!H81","v":0},{"$f":"'Order Form'!J81 & \"\"","v":""},{"$f":"'Order Form'!L81 & \"\"","v":""},{"$f":"'Order Form'!C81 & \"\"","v":""},{"$f":"'Order Form'!K81 & \"\"","v":""},{"$f":"'Order Form'!$E$14","v":"YES"},{"$f":"'Order Form'!$E$19","v":0},{"$f":"'Order Form'!$E$16","v":"FREE gift card"},{"$f":"'Order Form'!$E$17","v":"No thanks"},"No","No",{"$f":"\"Dispatch Week: \"&'Order Form'!$E$18","v":"Dispatch Week: "},{"$f":"\"VIP: \"&'Order Form'!$E$5 &\"; Rib: \"&'Order Form'!$E$17 &\"; GT: \"&'Order Form'!$E$16","v":"VIP: ; Rib: No thanks; GT: FREE gift card"},null,null,null,{"$f":"IF(P61=\"\",\"\",IFERROR(INDIRECT(\"Postcodes!$C\"&SUMPRODUCT(--(Postcodes!$A$2:$A$100<=P61)*(Postcodes!$B$2:$B$100>=P61), ROW(Postcodes!$A$2:$A$100))),\"WRONG CODE\"))","v":0},null,null,null,null,null,null,""]
[{"$f":"'Order Form'!A82","v":61},{"$f":"'Order Form'!M82","v":""},{"$f":"'Order Form'!$E$4","v":0},{"$f":"'Order Form'!$E$5","v":0},{"$f":"'Order Form'!$E$6","v":0},{"$f":"'Order Form'!$E$7","v":0},{"$f":"'Order Form'!$E$9","v":0},{"$f":"'Order Form'!$E$8","v":0},{"$f":"'Order Form'!$E$10","v":0},{"$f":"'Order Form'!$E$11","v":0},{"$f":"IF(('Order Form'!$E$15=\"YES\"),'Order Form'!$E$12,\"\")","v":0},{"$f":"'Order Form'!$E$13 & \"\"","v":""},{"$f":"IF('Order Form'!D82=\"\",'Order Form'!C82,'Order Form'!D82) & \"\"","v":""},{"$f":"'Order Form'!E82 & \"\"","v":""},{"$f":"'Order Form'!F82","v":0},{"$f":"'Order Form'!I82","v":0},{"$f":"'Order Form'!G82","v":0},{"$f":"'Order Form'!H82","v":0},{"$f":"'Order Form'!J82 & \"\"","v":""},{"$f":"'Order Form'!L82 & \"\"","v":""},{"$f":"'Order Form'!C82 & \"\"","v":""},{"$f":"'Order Form'!K82 & \"\"","v":""},{"$f":"'Order Form'!$E$14","v":"YES"},{"$f":"'Order Form'!$E$19","v":0},{"$f":"'Order Form'!$E$16","v":"FREE gift card"},{"$f":"'Order Form'!$E$17","v":"No thanks"},"No","No",{"$f":"\"Dispatch Week: \"&'Order Form'!$E$18","v":"Dispatch Week: "},{"$f":"\"VIP: \"&'Order Form'!$E$5 &\"; Rib: \"&'Order Form'!$E$17 &\"; GT: \"&'Order Form'!$E$16","v":"VIP: ; Rib: No thanks; GT: FREE gift card"},null,null,null,{"$f":"IF(P62=\"\",\"\",IFERROR(INDIRECT(\"Postcodes!$C\"&SUMPRODUCT(--(Postcodes!$A$2:$A$100<=P62)*(Postcodes!$B$2:$B$100>=P62), ROW(Postcodes!$A$2:$A$100))),\"WRONG CODE\"))","v":0},null,null,null,null,null,null,""]
[{"$f":"'Order Form'!A83","v":62},{"$f":"'Order Form'!M83","v":""},{"$f":"'Order Form'!$E$4","v":0},{"$f":"'Order Form'!$E$5","v":0},{"$f":"'Order Form'!$E$6","v":0},{"$f":"'Order Form'!$E$7","v":0},{"$f":"'Order Form'!$E$9","v":0},{"$f":"'Order Form'!$E$8","v":0},{"$f":"'Order Form'!$E$10","v":0},{"$f":"'Order Form'!$E$11","v":0},{"$f":"IF(('Order Form'!$E$15=\"YES\"),'Order Form'!$E$12,\"\")","v":0},{"$f":"'Order Form'!$E$13 & \"\"","v":""},{"$f":"IF('Order Form'!D83=\"\",'Order Form'!C83,'Order Form'!D83) & \"\"","v":""},{"$f":"'Order Form'!E83 & \"\"","v":""},{"$f":"'Order Form'!F83","v":0},{"$f":"'Order Form'!I83","v":0},{"$f":"'Order Form'!G83","v":0},{"$f":"'Order Form'!H83","v":0},{"$f":"'Order Form'!J83 & \"\"","v":""},{"$f":"'Order Form'!L83 & \"\"","v":""},{"$f":"'Order Form'!C83 & \"\"","v":""},{"$f":"'Order Form'!K83 & \"\"","v":""},{"$f":"'Order Form'!$E$14","v":"YES"},{"$f":"'Order Form'!$E$19","v":0},{"$f":"'Order Form'!$E$16","v":"FREE gift card"},{"$f":"'Order Form'!$E$17","v":"No thanks"},"No","No",{"$f":"\"Dispatch Week: \"&'Order Form'!$E$18","v":"Dispatch Week: "},{"$f":"\"VIP: \"&'Order Form'!$E$5 &\"; Rib: \"&'Order Form'!$E$17 &\"; GT: \"&'Order Form'!$E$16","v":"VIP: ; Rib: No thanks; GT: FREE gift card"},null,null,null,{"$f":"IF(P63=\"\",\"\",IFERROR(INDIRECT(\"Postcodes!$C\"&SUMPRODUCT(--(Postcodes!$A$2:$A$100<=P63)*(Postcodes!$B$2:$B$100>=P63), ROW(Postcodes!$A$2:$A$100))),\"WRONG CODE\"))","v":0},null,null,null,null,null,null,""]
[{"$f":"'Order Form'!A84","v":63},{"$f":"'Order Form'!M84","v":""},{"$f":"'Order Form'!$E$4","v":0},{"$f":"'Order Form'!$E$5","v":0},{"$f":"'Order Form'!$E$6","v":0},{"$f":"'Order Form'!$E$7","v":0},{"$f":"'Order Form'!$E$9","v":0},{"$f":"'Order Form'!$E$8","v":0},{"$f":"'Order Form'!$E$10","v":0},{"$f":"'Order Form'!$E$11","v":0},{"$f":"IF(('Order Form'!$E$15=\"YES\"),'Order Form'!$E$12,\"\")","v":0},{"$f":"'Order Form'!$E$13 & \"\"","v":""},{"$f":"IF('Order Form'!D84=\"\",'Order Form'!C84,'Order Form'!D84) & \"\"","v":""},{"$f":"'Order Form'!E84 & \"\"","v":""},{"$f":"'Order Form'!F84","v":0},{"$f":"'Order Form'!I84","v":0},{"$f":"'Order Form'!G84","v":0},{"$f":"'Order Form'!H84","v":0},{"$f":"'Order Form'!J84 & \"\"","v":""},{"$f":"'Order Form'!L84 & \"\"","v":""},{"$f":"'Order Form'!C84 & \"\"","v":""},{"$f":"'Order Form'!K84 & \"\"","v":""},{"$f":"'Order Form'!$E$14","v":"YES"},{"$f":"'Order Form'!$E$19","v":0},{"$f":"'Order Form'!$E$16","v":"FREE gift card"},{"$f":"'Order Form'!$E$17","v":"No thanks"},"No","No",{"$f":"\"Dispatch Week: \"&'Order Form'!$E$18","v":"Dispatch Week: "},{"$f":"\"VIP: \"&'Order Form'!$E$5 &\"; Rib: \"&'Order Form'!$E$17 &\"; GT: \"&'Order Form'!$E$16","v":"VIP: ; Rib: No thanks; GT: FREE gift card"},null,null,null,{"$f":"IF(P64=\"\",\"\",IFERROR(INDIRECT(\"Postcodes!$C\"&SUMPRODUCT(--(Postcodes!$A$2:$A$100<=P64)*(Postcodes!$B$2:$B$100>=P64), ROW(Postcodes!$A$2:$A$100))),\"WRONG CODE\"))","v":0},null,null,null,null,null,null,""]
[{"$f":"'Order Form'!A85","v":64},{"$f":"'Order Form'!M85","v":""},{"$f":"'Order Form'!$E$4","v":0},{"$f":"'Order Form'!$E$5","v":0},{"$f":"'Order Form'!$E$6","v":0},{"$f":"'Order Form'!$E$7","v":0},{"$f":"'Order Form'!$E$9","v":0},{"$f":"'Order Form'!$E$8","v":0},{"$f":"'Order Form'!$E$10","v":0},{"$f":"'Order Form'!$E$11","v":0},{"$f":"IF(('Order Form'!$E$15=\"YES\"),'Order Form'!$E$12,\"\")","v":0},{"$f":"'Order Form'!$E$13 & \"\"","v":""},{"$f":"IF('Order Form'!D85=\"\",'Order Form'!C85,'Order Form'!D85) & \"\"","v":""},{"$f":"'Order Form'!E85 & \"\"","v":""},{"$f":"'Order Form'!F85","v":0},{"$f":"'Order Form'!I85","v":0},{"$f":"'Order Form'!G85","v":0},{"$f":"'Order Form'!H85","v":0},{"$f":"'Order Form'!J85 & \"\"","v":""},{"$f":"'Order Form'!L85 & \"\"","v":""},{"$f":"'Order Form'!C85 & \"\"","v":""},{"$f":"'Order Form'!K85 & \"\"","v":""},{"$f":"'Order Form'!$E$14","v":"YES"},{"$f":"'Order Form'!$E$19","v":0},{"$f":"'Order Form'!$E$16","v":"FREE gift card"},{"$f":"'Order Form'!$E$17","v":"No thanks"},"No","No",{"$f":"\"Dispatch Week: \"&'Order Form'!$E$18","v":"Dispatch Week: "},{"$f":"\"VIP: \"&'Order Form'!$E$5 &\"; Rib: \"&'Order Form'!$E$17 &\"; GT: \"&'Order Form'!$E$16","v":"VIP: ; Rib: No thanks; GT: FREE gift card"},null,null,null,{"$f":"IF(P65=\"\",\"\",IFERROR(INDIRECT(\"Postcodes!$C\"&SUMPRODUCT(--(Postcodes!$A$2:$A$100<=P65)*(Postcodes!$B$2:$B$100>=P65), ROW(Postcodes!$A$2:$A$100))),\"WRONG CODE\"))","v":0},null,null,null,null,null,null,""]
[{"$f":"'Order Form'!A86","v":65},{"$f":"'Order Form'!M86","v":""},{"$f":"'Order Form'!$E$4","v":0},{"$f":"'Order Form'!$E$5","v":0},{"$f":"'Order Form'!$E$6","v":0},{"$f":"'Order Form'!$E$7","v":0},{"$f":"'Order Form'!$E$9","v":0},{"$f":"'Order Form'!$E$8","v":0},{"$f":"'Order Form'!$E$10","v":0},{"$f":"'Order Form'!$E$11","v":0},{"$f":"IF(('Order Form'!$E$15=\"YES\"),'Order Form'!$E$12,\"\")","v":0},{"$f":"'Order Form'!$E$13 & \"\"","v":""},{"$f":"IF('Order Form'!D86=\"\",'Order Form'!C86,'Order Form'!D86) & \"\"","v":""},{"$f":"'Order Form'!E86 & \"\"","v":""},{"$f":"'Order Form'!F86","v":0},{"$f":"'Order Form'!I86","v":0},{"$f":"'Order Form'!G86","v":0},{"$f":"'Order Form'!H86","v":0},{"$f":"'Order Form'!J86 & \"\"","v":""},{"$f":"'Order Form'!L86 & \"\"","v":""},{"$f":"'Order Form'!C86 & \"\"","v":""},{"$f":"'Order Form'!K86 & \"\"","v":""},{"$f":"'Order Form'!$E$14","v":"YES"},{"$f":"'Order Form'!$E$19","v":0},{"$f":"'Order Form'!$E$16","v":"FREE gift card"},{"$f":"'Order Form'!$E$17","v":"No thanks"},"No","No",{"$f":"\"Dispatch Week: \"&'Order Form'!$E$18","v":"Dispatch Week: "},{"$f":"\"VIP: \"&'Order Form'!$E$5 &\"; Rib: \"&'Order Form'!$E$17 &\"; GT: \"&'Order Form'!$E$16","v":"VIP: ; Rib: No thanks; GT: FREE gift card"},null,null,null,{"$f":"IF(P66=\"\",\"\",IFERROR(INDIRECT(\"Postcodes!$C\"&SUMPRODUCT(--(Postcodes!$A$2:$A$100<=P66)*(Postcodes!$B$2:$B$100>=P66), ROW(Postcodes!$A$2:$A$100))),\"WRONG CODE\"))","v":0},null,null,null,null,null,null,""]
[{"$f":"'Order Form'!A87","v":66},{"$f":"'Order Form'!M87","v":""},{"$f":"'Order Form'!$E$4","v":0},{"$f":"'Order Form'!$E$5","v":0},{"$f":"'Order Form'!$E$6","v":0},{"$f":"'Order Form'!$E$7","v":0},{"$f":"'Order Form'!$E$9","v":0},{"$f":"'Order Form'!$E$8","v":0},{"$f":"'Order Form'!$E$10","v":0},{"$f":"'Order Form'!$E$11","v":0},{"$f":"IF(('Order Form'!$E$15=\"YES\"),'Order Form'!$E$12,\"\")","v":0},{"$f":"'Order Form'!$E$13 & \"\"","v":""},{"$f":"IF('Order Form'!D87=\"\",'Order Form'!C87,'Order Form'!D87) & \"\"","v":""},{"$f":"'Order Form'!E87 & \"\"","v":""},{"$f":"'Order Form'!F87","v":0},{"$f":"'Order Form'!I87","v":0},{"$f":"'Order Form'!G87","v":0},{"$f":"'Order Form'!H87","v":0},{"$f":"'Order Form'!J87 & \"\"","v":""},{"$f":"'Order Form'!L87 & \"\"","v":""},{"$f":"'Order Form'!C87 & \"\"","v":""},{"$f":"'Order Form'!K87 & \"\"","v":""},{"$f":"'Order Form'!$E$14","v":"YES"},{"$f":"'Order Form'!$E$19","v":0},{"$f":"'Order Form'!$E$16","v":"FREE gift card"},{"$f":"'Order Form'!$E$17","v":"No thanks"},{"$f":"IF(OR(Y67=\"FREE gift card\",Y67=\"No Cards\"),\"No\",\"Yes\")","v":"No"},{"$f":"IF($Z$2=\"No thanks\",\"No\",\"Yes\")","v":"No"},{"$f":"\"Dispatch Week: \"&'Order Form'!$E$18","v":"Dispatch Week: "},{"$f":"\"VIP: \"&'Order Form'!$E$5 &\"; Rib: \"&'Order Form'!$E$17 &\"; GT: \"&'Order Form'!$E$16","v":"VIP: ; Rib: No thanks; GT: FREE gift card"},null,null,null,{"$f":"IF(P67=\"\",\"\",IFERROR(INDIRECT(\"Postcodes!$C\"&SUMPRODUCT(--(Postcodes!$A$2:$A$100<=P67)*(Postcodes!$B$2:$B$100>=P67), ROW(Postcodes!$A$2:$A$100))),\"WRONG CODE\"))","v":0},null,null,null,null,null,null,{"$f":"IF(AND(X67=\"ASAP\",Y67=\"FREE gift card\",Z67=\"No Thanks\"),\"asap\",\"\")","v":""}]
[{"$f":"'Order Form'!A88","v":67},{"$f":"'Order Form'!M88","v":""},{"$f":"'Order Form'!$E$4","v":0},{"$f":"'Order Form'!$E$5","v":0},{"$f":"'Order Form'!$E$6","v":0},{"$f":"'Order Form'!$E$7","v":0},{"$f":"'Order Form'!$E$9","v":0},{"$f":"'Order Form'!$E$8","v":0},{"$f":"'Order Form'!$E$10","v":0},{"$f":"'Order Form'!$E$11","v":0},{"$f":"IF(('Order Form'!$E$15=\"YES\"),'Order Form'!$E$12,\"\")","v":0},{"$f":"'Order Form'!$E$13 & \"\"","v":""},{"$f":"IF('Order Form'!D88=\"\",'Order Form'!C88,'Order Form'!D88) & \"\"","v":""},{"$f":"'Order Form'!E88 & \"\"","v":""},{"$f":"'Order Form'!F88","v":0},{"$f":"'Order Form'!I88","v":0},{"$f":"'Order Form'!G88","v":0},{"$f":"'Order Form'!H88","v":0},{"$f":"'Order Form'!J88 & \"\"","v":""},{"$f":"'Order Form'!L88 & \"\"","v":""},{"$f":"'Order Form'!C88 & \"\"","v":""},{"$f":"'Order Form'!K88 & \"\"","v":""},{"$f":"'Order Form'!$E$14","v":"YES"},{"$f":"'Order Form'!$E$19","v":0},{"$f":"'Order Form'!$E$16","v":"FREE gift card"},{"$f":"'Order Form'!$E$17","v":"No thanks"},"No","No",{"$f":"\"Dispatch Week: \"&'Order Form'!$E$18","v":"Dispatch Week: "},{"$f":"\"VIP: \"&'Order Form'!$E$5 &\"; Rib: \"&'Order Form'!$E$17 &\"; GT: \"&'Order Form'!$E$16","v":"VIP: ; Rib: No thanks; GT: FREE gift card"},null,null,null,{"$f":"IF(P68=\"\",\"\",IFERROR(INDIRECT(\"Postcodes!$C\"&SUMPRODUCT(--(Postcodes!$A$2:$A$100<=P68)*(Postcodes!$B$2:$B$100>=P68), ROW(Postcodes!$A$2:$A$100))),\"WRONG CODE\"))","v":0},null,null,null,null,null,null,""]
[{"$f":"'Order Form'!A89","v":68},{"$f":"'Order Form'!M89","v":""},{"$f":"'Order Form'!$E$4","v":0},{"$f":"'Order Form'!$E$5","v":0},{"$f":"'Order Form'!$E$6","v":0},{"$f":"'Order Form'!$E$7","v":0},{"$f":"'Order Form'!$E$9","v":0},{"$f":"'Order Form'!$E$8","v":0},{"$f":"'Order Form'!$E$10","v":0},{"$f":"'Order Form'!$E$11","v":0},{"$f":"IF(('Order Form'!$E$15=\"YES\"),'Order Form'!$E$12,\"\")","v":0},{"$f":"'Order Form'!$E$13 & \"\"","v":""},{"$f":"IF('Order Form'!D89=\"\",'Order Form'!C89,'Order Form'!D89) & \"\"","v":""},{"$f":"'Order Form'!E89 & \"\"","v":""},{"$f":"'Order Form'!F89","v":0},{"$f":"'Order Form'!I89","v":0},{"$f":"'Order Form'!G89","v":0},{"$f":"'Order Form'!H89","v":0},{"$f":"'Order Form'!J89 & \"\"","v":""},{"$f":"'Order Form'!L89 & \"\"","v":""},{"$f":"'Order Form'!C89 & \"\"","v":""},{"$f":"'Order Form'!K89 & \"\"","v":""},{"$f":"'Order Form'!$E$14","v":"YES"},{"$f":"'Order Form'!$E$19","v":0},{"$f":"'Order Form'!$E$16","v":"FREE gift card"},{"$f":"'Order Form'!$E$17","v":"No thanks"},"No","No",{"$f":"\"Dispatch Week: \"&'Order Form'!$E$18","v":"Dispatch Week: "},{"$f":"\"VIP: \"&'Order Form'!$E$5 &\"; Rib: \"&'Order Form'!$E$17 &\"; GT: \"&'Order Form'!$E$16","v":"VIP: ; Rib: No thanks; GT: FREE gift card"},null,null,null,{"$f":"IF(P69=\"\",\"\",IFERROR(INDIRECT(\"Postcodes!$C\"&SUMPRODUCT(--(Postcodes!$A$2:$A$100<=P69)*(Postcodes!$B$2:$B$100>=P69), ROW(Postcodes!$A$2:$A$100))),\"WRONG CODE\"))","v":0},null,null,null,null,null,null,""]
[{"$f":"'Order Form'!A90","v":69},{"$f":"'Order Form'!M90","v":""},{"$f":"'Order Form'!$E$4","v":0},{"$f":"'Order Form'!$E$5","v":0},{"$f":"'Order Form'!$E$6","v":0},{"$f":"'Order Form'!$E$7","v":0},{"$f":"'Order Form'!$E$9","v":0},{"$f":"'Order Form'!$E$8","v":0},{"$f":"'Order Form'!$E$10","v":0},{"$f":"'Order Form'!$E$11","v":0},{"$f":"IF(('Order Form'!$E$15=\"YES\"),'Order Form'!$E$12,\"\")","v":0},{"$f":"'Order Form'!$E$13 & \"\"","v":""},{"$f":"IF('Order Form'!D90=\"\",'Order Form'!C90,'Order Form'!D90) & \"\"","v":""},{"$f":"'Order Form'!E90 & \"\"","v":""},{"$f":"'Order Form'!F90","v":0},{"$f":"'Order Form'!I90","v":0},{"$f":"'Order Form'!G90","v":0},{"$f":"'Order Form'!H90","v":0},{"$f":"'Order Form'!J90 & \"\"","v":""},{"$f":"'Order Form'!L90 & \"\"","v":""},{"$f":"'Order Form'!C90 & \"\"","v":""},{"$f":"'Order Form'!K90 & \"\"","v":""},{"$f":"'Order Form'!$E$14","v":"YES"},{"$f":"'Order Form'!$E$19","v":0},{"$f":"'Order Form'!$E$16","v":"FREE gift card"},{"$f":"'Order Form'!$E$17","v":"No thanks"},"No","No",{"$f":"\"Dispatch Week: \"&'Order Form'!$E$18","v":"Dispatch Week: "},{"$f":"\"VIP: \"&'Order Form'!$E$5 &\"; Rib: \"&'Order Form'!$E$17 &\"; GT: \"&'Order Form'!$E$16","v":"VIP: ; Rib: No thanks; GT: FREE gift card"},null,null,null,{"$f":"IF(P70=\"\",\"\",IFERROR(INDIRECT(\"Postcodes!$C\"&SUMPRODUCT(--(Postcodes!$A$2:$A$100<=P70)*(Postcodes!$B$2:$B$100>=P70), ROW(Postcodes!$A$2:$A$100))),\"WRONG CODE\"))","v":0},null,null,null,null,null,null,""]
[{"$f":"'Order Form'!A91","v":70},{"$f":"'Order Form'!M91","v":""},{"$f":"'Order Form'!$E$4","v":0},{"$f":"'Order Form'!$E$5","v":0},{"$f":"'Order Form'!$E$6","v":0},{"$f":"'Order Form'!$E$7","v":0},{"$f":"'Order Form'!$E$9","v":0},{"$f":"'Order Form'!$E$8","v":0},{"$f":"'Order Form'!$E$10","v":0},{"$f":"'Order Form'!$E$11","v":0},{"$f":"IF(('Order Form'!$E$15=\"YES\"),'Order Form'!$E$12,\"\")","v":0},{"$f":"'Order Form'!$E$13 & \"\"","v":""},{"$f":"IF('Order Form'!D91=\"\",'Order Form'!C91,'Order Form'!D91) & \"\"","v":""},{"$f":"'Order Form'!E91 & \"\"","v":""},{"$f":"'Order Form'!F91","v":0},{"$f":"'Order Form'!I91","v":0},{"$f":"'Order Form'!G91","v":0},{"$f":"'Order Form'!H91","v":0},{"$f":"'Order Form'!J91 & \"\"","v":""},{"$f":"'Order Form'!L91 & \"\"","v":""},{"$f":"'Order Form'!C91 & \"\"","v":""},{"$f":"'Order Form'!K91 & \"\"","v":""},{"$f":"'Order Form'!$E$14","v":"YES"},{"$f":"'Order Form'!$E$19","v":0},{"$f":"'Order Form'!$E$16","v":"FREE gift card"},{"$f":"'Order Form'!$E$17","v":"No thanks"},"No","No",{"$f":"\"Dispatch Week: \"&'Order Form'!$E$18","v":"Dispatch Week: "},{"$f":"\"VIP: \"&'Order Form'!$E$5 &\"; Rib: \"&'Order Form'!$E$17 &\"; GT: \"&'Order Form'!$E$16","v":"VIP: ; Rib: No thanks; GT: FREE gift card"},null,null,null,{"$f":"IF(P71=\"\",\"\",IFERROR(INDIRECT(\"Postcodes!$C\"&SUMPRODUCT(--(Postcodes!$A$2:$A$100<=P71)*(Postcodes!$B$2:$B$100>=P71), ROW(Postcodes!$A$2:$A$100))),\"WRONG CODE\"))","v":0},null,null,null,null,null,null,""]
[{"$f":"'Order Form'!A92","v":71},{"$f":"'Order Form'!M92","v":""},{"$f":"'Order Form'!$E$4","v":0},{"$f":"'Order Form'!$E$5","v":0},{"$f":"'Order Form'!$E$6","v":0},{"$f":"'Order Form'!$E$7","v":0},{"$f":"'Order Form'!$E$9","v":0},{"$f":"'Order Form'!$E$8","v":0},{"$f":"'Order Form'!$E$10","v":0},{"$f":"'Order Form'!$E$11","v":0},{"$f":"IF(('Order Form'!$E$15=\"YES\"),'Order Form'!$E$12,\"\")","v":0},{"$f":"'Order Form'!$E$13 & \"\"","v":""},{"$f":"IF('Order Form'!D92=\"\",'Order Form'!C92,'Order Form'!D92) & \"\"","v":""},{"$f":"'Order Form'!E92 & \"\"","v":""},{"$f":"'Order Form'!F92","v":0},{"$f":"'Order Form'!I92","v":0},{"$f":"'Order Form'!G92","v":0},{"$f":"'Order Form'!H92","v":0},{"$f":"'Order Form'!J92 & \"\"","v":""},{"$f":"'Order Form'!L92 & \"\"","v":""},{"$f":"'Order Form'!C92 & \"\"","v":""},{"$f":"'Order Form'!K92 & \"\"","v":""},{"$f":"'Order Form'!$E$14","v":"YES"},{"$f":"'Order Form'!$E$19","v":0},{"$f":"'Order Form'!$E$16","v":"FREE gift card"},{"$f":"'Order Form'!$E$17","v":"No thanks"},"No","No",{"$f":"\"Dispatch Week: \"&'Order Form'!$E$18","v":"Dispatch Week: "},{"$f":"\"VIP: \"&'Order Form'!$E$5 &\"; Rib: \"&'Order Form'!$E$17 &\"; GT: \"&'Order Form'!$E$16","v":"VIP: ; Rib: No thanks; GT: FREE gift card"},null,null,null,{"$f":"IF(P72=\"\",\"\",IFERROR(INDIRECT(\"Postcodes!$C\"&SUMPRODUCT(--(Postcodes!$A$2:$A$100<=P72)*(Postcodes!$B$2:$B$100>=P72), ROW(Postcodes!$A$2:$A$100))),\"WRONG CODE\"))","v":0},null,null,null,null,null,null,""]
[{"$f":"'Order Form'!A93","v":72},{"$f":"'Order Form'!M93","v":""},{"$f":"'Order Form'!$E$4","v":0},{"$f":"'Order Form'!$E$5","v":0},{"$f":"'Order Form'!$E$6","v":0},{"$f":"'Order Form'!$E$7","v":0},{"$f":"'Order Form'!$E$9","v":0},{"$f":"'Order Form'!$E$8","v":0},{"$f":"'Order Form'!$E$10","v":0},{"$f":"'Order Form'!$E$11","v":0},{"$f":"IF(('Order Form'!$E$15=\"YES\"),'Order Form'!$E$12,\"\")","v":0},{"$f":"'Order Form'!$E$13 & \"\"","v":""},{"$f":"IF('Order Form'!D93=\"\",'Order Form'!C93,'Order Form'!D93) & \"\"","v":""},{"$f":"'Order Form'!E93 & \"\"","v":""},{"$f":"'Order Form'!F93","v":0},{"$f":"'Order Form'!I93","v":0},{"$f":"'Order Form'!G93","v":0},{"$f":"'Order Form'!H93","v":0},{"$f":"'Order Form'!J93 & \"\"","v":""},{"$f":"'Order Form'!L93 & \"\"","v":""},{"$f":"'Order Form'!C93 & \"\"","v":""},{"$f":"'Order Form'!K93 & \"\"","v":""},{"$f":"'Order Form'!$E$14","v":"YES"},{"$f":"'Order Form'!$E$19","v":0},{"$f":"'Order Form'!$E$16","v":"FREE gift card"},{"$f":"'Order Form'!$E$17","v":"No thanks"},"No","No",{"$f":"\"Dispatch Week: \"&'Order Form'!$E$18","v":"Dispatch Week: "},{"$f":"\"VIP: \"&'Order Form'!$E$5 &\"; Rib: \"&'Order Form'!$E$17 &\"; GT: \"&'Order Form'!$E$16","v":"VIP: ; Rib: No thanks; GT: FREE gift card"},null,null,null,{"$f":"IF(P73=\"\",\"\",IFERROR(INDIRECT(\"Postcodes!$C\"&SUMPRODUCT(--(Postcodes!$A$2:$A$100<=P73)*(Postcodes!$B$2:$B$100>=P73), ROW(Postcodes!$A$2:$A$100))),\"WRONG CODE\"))","v":0},null,null,null,null,null,null,""]
[{"$f":"'Order Form'!A94","v":73},{"$f":"'Order Form'!M94","v":""},{"$f":"'Order Form'!$E$4","v":0},{"$f":"'Order Form'!$E$5","v":0},{"$f":"'Order Form'!$E$6","v":0},{"$f":"'Order Form'!$E$7","v":0},{"$f":"'Order Form'!$E$9","v":0},{"$f":"'Order Form'!$E$8","v":0},{"$f":"'Order Form'!$E$10","v":0},{"$f":"'Order Form'!$E$11","v":0},{"$f":"IF(('Order Form'!$E$15=\"YES\"),'Order Form'!$E$12,\"\")","v":0},{"$f":"'Order Form'!$E$13 & \"\"","v":""},{"$f":"IF('Order Form'!D94=\"\",'Order Form'!C94,'Order Form'!D94) & \"\"","v":""},{"$f":"'Order Form'!E94 & \"\"","v":""},{"$f":"'Order Form'!F94","v":0},{"$f":"'Order Form'!I94","v":0},{"$f":"'Order Form'!G94","v":0},{"$f":"'Order Form'!H94","v":0},{"$f":"'Order Form'!J94 & \"\"","v":""},{"$f":"'Order Form'!L94 & \"\"","v":""},{"$f":"'Order Form'!C94 & \"\"","v":""},{"$f":"'Order Form'!K94 & \"\"","v":""},{"$f":"'Order Form'!$E$14","v":"YES"},{"$f":"'Order Form'!$E$19","v":0},{"$f":"'Order Form'!$E$16","v":"FREE gift card"},{"$f":"'Order Form'!$E$17","v":"No thanks"},"No","No",{"$f":"\"Dispatch Week: \"&'Order Form'!$E$18","v":"Dispatch Week: "},{"$f":"\"VIP: \"&'Order Form'!$E$5 &\"; Rib: \"&'Order Form'!$E$17 &\"; GT: \"&'Order Form'!$E$16","v":"VIP: ; Rib: No thanks; GT: FREE gift card"},null,null,null,{"$f":"IF(P74=\"\",\"\",IFERROR(INDIRECT(\"Postcodes!$C\"&SUMPRODUCT(--(Postcodes!$A$2:$A$100<=P74)*(Postcodes!$B$2:$B$100>=P74), ROW(Postcodes!$A$2:$A$100))),\"WRONG CODE\"))","v":0},null,null,null,null,null,null,""]
[{"$f":"'Order Form'!A95","v":74},{"$f":"'Order Form'!M95","v":""},{"$f":"'Order Form'!$E$4","v":0},{"$f":"'Order Form'!$E$5","v":0},{"$f":"'Order Form'!$E$6","v":0},{"$f":"'Order Form'!$E$7","v":0},{"$f":"'Order Form'!$E$9","v":0},{"$f":"'Order Form'!$E$8","v":0},{"$f":"'Order Form'!$E$10","v":0},{"$f":"'Order Form'!$E$11","v":0},{"$f":"IF(('Order Form'!$E$15=\"YES\"),'Order Form'!$E$12,\"\")","v":0},{"$f":"'Order Form'!$E$13 & \"\"","v":""},{"$f":"IF('Order Form'!D95=\"\",'Order Form'!C95,'Order Form'!D95) & \"\"","v":""},{"$f":"'Order Form'!E95 & \"\"","v":""},{"$f":"'Order Form'!F95","v":0},{"$f":"'Order Form'!I95","v":0},{"$f":"'Order Form'!G95","v":0},{"$f":"'Order Form'!H95","v":0},{"$f":"'Order Form'!J95 & \"\"","v":""},{"$f":"'Order Form'!L95 & \"\"","v":""},{"$f":"'Order Form'!C95 & \"\"","v":""},{"$f":"'Order Form'!K95 & \"\"","v":""},{"$f":"'Order Form'!$E$14","v":"YES"},{"$f":"'Order Form'!$E$19","v":0},{"$f":"'Order Form'!$E$16","v":"FREE gift card"},{"$f":"'Order Form'!$E$17","v":"No thanks"},"No","No",{"$f":"\"Dispatch Week: \"&'Order Form'!$E$18","v":"Dispatch Week: "},{"$f":"\"VIP: \"&'Order Form'!$E$5 &\"; Rib: \"&'Order Form'!$E$17 &\"; GT: \"&'Order Form'!$E$16","v":"VIP: ; Rib: No thanks; GT: FREE gift card"},null,null,null,{"$f":"IF(P75=\"\",\"\",IFERROR(INDIRECT(\"Postcodes!$C\"&SUMPRODUCT(--(Postcodes!$A$2:$A$100<=P75)*(Postcodes!$B$2:$B$100>=P75), ROW(Postcodes!$A$2:$A$100))),\"WRONG CODE\"))","v":0},null,null,null,null,null,null,""]
[{"$f":"'Order Form'!A96","v":75},{"$f":"'Order Form'!M96","v":""},{"$f":"'Order Form'!$E$4","v":0},{"$f":"'Order Form'!$E$5","v":0},{"$f":"'Order Form'!$E$6","v":0},{"$f":"'Order Form'!$E$7","v":0},{"$f":"'Order Form'!$E$9","v":0},{"$f":"'Order Form'!$E$8","v":0},{"$f":"'Order Form'!$E$10","v":0},{"$f":"'Order Form'!$E$11","v":0},{"$f":"IF(('Order Form'!$E$15=\"YES\"),'Order Form'!$E$12,\"\")","v":0},{"$f":"'Order Form'!$E$13 & \"\"","v":""},{"$f":"IF('Order Form'!D96=\"\",'Order Form'!C96,'Order Form'!D96) & \"\"","v":""},{"$f":"'Order Form'!E96 & \"\"","v":""},{"$f":"'Order Form'!F96","v":0},{"$f":"'Order Form'!I96","v":0},{"$f":"'Order Form'!G96","v":0},{"$f":"'Order Form'!H96","v":0},{"$f":"'Order Form'!J96 & \"\"","v":""},{"$f":"'Order Form'!L96 & \"\"","v":""},{"$f":"'Order Form'!C96 & \"\"","v":""},{"$f":"'Order Form'!K96 & \"\"","v":""},{"$f":"'Order Form'!$E$14","v":"YES"},{"$f":"'Order Form'!$E$19","v":0},{"$f":"'Order Form'!$E$16","v":"FREE gift card"},{"$f":"'Order Form'!$E$17","v":"No thanks"},"No","No",{"$f":"\"Dispatch Week: \"&'Order Form'!$E$18","v":"Dispatch Week: "},{"$f":"\"VIP: \"&'Order Form'!$E$5 &\"; Rib: \"&'Order Form'!$E$17 &\"; GT: \"&'Order Form'!$E$16","v":"VIP: ; Rib: No thanks; GT: FREE gift card"},null,null,null,{"$f":"IF(P76=\"\",\"\",IFERROR(INDIRECT(\"Postcodes!$C\"&SUMPRODUCT(--(Postcodes!$A$2:$A$100<=P76)*(Postcodes!$B$2:$B$100>=P76), ROW(Postcodes!$A$2:$A$100))),\"WRONG CODE\"))","v":0},null,null,null,null,null,null,""]
[{"$f":"'Order Form'!A97","v":76},{"$f":"'Order Form'!M97","v":""},{"$f":"'Order Form'!$E$4","v":0},{"$f":"'Order Form'!$E$5","v":0},{"$f":"'Order Form'!$E$6","v":0},{"$f":"'Order Form'!$E$7","v":0},{"$f":"'Order Form'!$E$9","v":0},{"$f":"'Order Form'!$E$8","v":0},{"$f":"'Order Form'!$E$10","v":0},{"$f":"'Order Form'!$E$11","v":0},{"$f":"IF(('Order Form'!$E$15=\"YES\"),'Order Form'!$E$12,\"\")","v":0},{"$f":"'Order Form'!$E$13 & \"\"","v":""},{"$f":"IF('Order Form'!D97=\"\",'Order Form'!C97,'Order Form'!D97) & \"\"","v":""},{"$f":"'Order Form'!E97 & \"\"","v":""},{"$f":"'Order Form'!F97","v":0},{"$f":"'Order Form'!I97","v":0},{"$f":"'Order Form'!G97","v":0},{"$f":"'Order Form'!H97","v":0},{"$f":"'Order Form'!J97 & \"\"","v":""},{"$f":"'Order Form'!L97 & \"\"","v":""},{"$f":"'Order Form'!C97 & \"\"","v":""},{"$f":"'Order Form'!K97 & \"\"","v":""},{"$f":"'Order Form'!$E$14","v":"YES"},{"$f":"'Order Form'!$E$19","v":0},{"$f":"'Order Form'!$E$16","v":"FREE gift card"},{"$f":"'Order Form'!$E$17","v":"No thanks"},"No","No",{"$f":"\"Dispatch Week: \"&'Order Form'!$E$18","v":"Dispatch Week: "},{"$f":"\"VIP: \"&'Order Form'!$E$5 &\"; Rib: \"&'Order Form'!$E$17 &\"; GT: \"&'Order Form'!$E$16","v":"VIP: ; Rib: No thanks; GT: FREE gift card"},null,null,null,{"$f":"IF(P77=\"\",\"\",IFERROR(INDIRECT(\"Postcodes!$C\"&SUMPRODUCT(--(Postcodes!$A$2:$A$100<=P77)*(Postcodes!$B$2:$B$100>=P77), ROW(Postcodes!$A$2:$A$100))),\"WRONG CODE\"))","v":0},null,null,null,null,null,null,""]
[{"$f":"'Order Form'!A98","v":77},{"$f":"'Order Form'!M98","v":""},{"$f":"'Order Form'!$E$4","v":0},{"$f":"'Order Form'!$E$5","v":0},{"$f":"'Order Form'!$E$6","v":0},{"$f":"'Order Form'!$E$7","v":0},{"$f":"'Order Form'!$E$9","v":0},{"$f":"'Order Form'!$E$8","v":0},{"$f":"'Order Form'!$E$10","v":0},{"$f":"'Order Form'!$E$11","v":0},{"$f":"IF(('Order Form'!$E$15=\"YES\"),'Order Form'!$E$12,\"\")","v":0},{"$f":"'Order Form'!$E$13 & \"\"","v":""},{"$f":"IF('Order Form'!D98=\"\",'Order Form'!C98,'Order Form'!D98) & \"\"","v":""},{"$f":"'Order Form'!E98 & \"\"","v":""},{"$f":"'Order Form'!F98","v":0},{"$f":"'Order Form'!I98","v":0},{"$f":"'Order Form'!G98","v":0},{"$f":"'Order Form'!H98","v":0},{"$f":"'Order Form'!J98 & \"\"","v":""},{"$f":"'Order Form'!L98 & \"\"","v":""},{"$f":"'Order Form'!C98 & \"\"","v":""},{"$f":"'Order Form'!K98 & \"\"","v":""},{"$f":"'Order Form'!$E$14","v":"YES"},{"$f":"'Order Form'!$E$19","v":0},{"$f":"'Order Form'!$E$16","v":"FREE gift card"},{"$f":"'Order Form'!$E$17","v":"No thanks"},"No","No",{"$f":"\"Dispatch Week: \"&'Order Form'!$E$18","v":"Dispatch Week: "},{"$f":"\"VIP: \"&'Order Form'!$E$5 &\"; Rib: \"&'Order Form'!$E$17 &\"; GT: \"&'Order Form'!$E$16","v":"VIP: ; Rib: No thanks; GT: FREE gift card"},null,null,null,{"$f":"IF(P78=\"\",\"\",IFERROR(INDIRECT(\"Postcodes!$C\"&SUMPRODUCT(--(Postcodes!$A$2:$A$100<=P78)*(Postcodes!$B$2:$B$100>=P78), ROW(Postcodes!$A$2:$A$100))),\"WRONG CODE\"))","v":0},null,null,null,null,null,null,""]
[{"$f":"'Order Form'!A99","v":78},{"$f":"'Order Form'!M99","v":""},{"$f":"'Order Form'!$E$4","v":0},{"$f":"'Order Form'!$E$5","v":0},{"$f":"'Order Form'!$E$6","v":0},{"$f":"'Order Form'!$E$7","v":0},{"$f":"'Order Form'!$E$9","v":0},{"$f":"'Order Form'!$E$8","v":0},{"$f":"'Order Form'!$E$10","v":0},{"$f":"'Order Form'!$E$11","v":0},{"$f":"IF(('Order Form'!$E$15=\"YES\"),'Order Form'!$E$12,\"\")","v":0},{"$f":"'Order Form'!$E$13 & \"\"","v":""},{"$f":"IF('Order Form'!D99=\"\",'Order Form'!C99,'Order Form'!D99) & \"\"","v":""},{"$f":"'Order Form'!E99 & \"\"","v":""},{"$f":"'Order Form'!F99","v":0},{"$f":"'Order Form'!I99","v":0},{"$f":"'Order Form'!G99","v":0},{"$f":"'Order Form'!H99","v":0},{"$f":"'Order Form'!J99 & \"\"","v":""},{"$f":"'Order Form'!L99 & \"\"","v":""},{"$f":"'Order Form'!C99 & \"\"","v":""},{"$f":"'Order Form'!K99 & \"\"","v":""},{"$f":"'Order Form'!$E$14","v":"YES"},{"$f":"'Order Form'!$E$19","v":0},{"$f":"'Order Form'!$E$16","v":"FREE gift card"},{"$f":"'Order Form'!$E$17","v":"No thanks"},"No","No",{"$f":"\"Dispatch Week: \"&'Order Form'!$E$18","v":"Dispatch Week: "},{"$f":"\"VIP: \"&'Order Form'!$E$5 &\"; Rib: \"&'Order Form'!$E$17 &\"; GT: \"&'Order Form'!$E$16","v":"VIP: ; Rib: No thanks; GT: FREE gift card"},null,null,null,{"$f":"IF(P79=\"\",\"\",IFERROR(INDIRECT(\"Postcodes!$C\"&SUMPRODUCT(--(Postcodes!$A$2:$A$100<=P79)*(Postcodes!$B$2:$B$100>=P79), ROW(Postcodes!$A$2:$A$100))),\"WRONG CODE\"))","v":0},null,null,null,null,null,null,""]
[{"$f":"'Order Form'!A100","v":79},{"$f":"'Order Form'!M100","v":""},{"$f":"'Order Form'!$E$4","v":0},{"$f":"'Order Form'!$E$5","v":0},{"$f":"'Order Form'!$E$6","v":0},{"$f":"'Order Form'!$E$7","v":0},{"$f":"'Order Form'!$E$9","v":0},{"$f":"'Order Form'!$E$8","v":0},{"$f":"'Order Form'!$E$10","v":0},{"$f":"'Order Form'!$E$11","v":0},{"$f":"IF(('Order Form'!$E$15=\"YES\"),'Order Form'!$E$12,\"\")","v":0},{"$f":"'Order Form'!$E$13 & \"\"","v":""},{"$f":"IF('Order Form'!D100=\"\",'Order Form'!C100,'Order Form'!D100) & \"\"","v":""},{"$f":"'Order Form'!E100 & \"\"","v":""},{"$f":"'Order Form'!F100","v":0},{"$f":"'Order Form'!I100","v":0},{"$f":"'Order Form'!G100","v":0},{"$f":"'Order Form'!H100","v":0},{"$f":"'Order Form'!J100 & \"\"","v":""},{"$f":"'Order Form'!L100 & \"\"","v":""},{"$f":"'Order Form'!C100 & \"\"","v":""},{"$f":"'Order Form'!K100 & \"\"","v":""},{"$f":"'Order Form'!$E$14","v":"YES"},{"$f":"'Order Form'!$E$19","v":0},{"$f":"'Order Form'!$E$16","v":"FREE gift card"},{"$f":"'Order Form'!$E$17","v":"No thanks"},"No","No",{"$f":"\"Dispatch Week: \"&'Order Form'!$E$18","v":"Dispatch Week: "},{"$f":"\"VIP: \"&'Order Form'!$E$5 &\"; Rib: \"&'Order Form'!$E$17 &\"; GT: \"&'Order Form'!$E$16","v":"VIP: ; Rib: No thanks; GT: FREE gift card"},null,null,null,{"$f":"IF(P80=\"\",\"\",IFERROR(INDIRECT(\"Postcodes!$C\"&SUMPRODUCT(--(Postcodes!$A$2:$A$100<=P80)*(Postcodes!$B$2:$B$100>=P80), ROW(Postcodes!$A$2:$A$100))),\"WRONG CODE\"))","v":0},null,null,null,null,null,null,""]
[{"$f":"'Order Form'!A101","v":80},{"$f":"'Order Form'!M101","v":""},{"$f":"'Order Form'!$E$4","v":0},{"$f":"'Order Form'!$E$5","v":0},{"$f":"'Order Form'!$E$6","v":0},{"$f":"'Order Form'!$E$7","v":0},{"$f":"'Order Form'!$E$9","v":0},{"$f":"'Order Form'!$E$8","v":0},{"$f":"'Order Form'!$E$10","v":0},{"$f":"'Order Form'!$E$11","v":0},{"$f":"IF(('Order Form'!$E$15=\"YES\"),'Order Form'!$E$12,\"\")","v":0},{"$f":"'Order Form'!$E$13 & \"\"","v":""},{"$f":"IF('Order Form'!D101=\"\",'Order Form'!C101,'Order Form'!D101) & \"\"","v":""},{"$f":"'Order Form'!E101 & \"\"","v":""},{"$f":"'Order Form'!F101","v":0},{"$f":"'Order Form'!I101","v":0},{"$f":"'Order Form'!G101","v":0},{"$f":"'Order Form'!H101","v":0},{"$f":"'Order Form'!J101 & \"\"","v":""},{"$f":"'Order Form'!L101 & \"\"","v":""},{"$f":"'Order Form'!C101 & \"\"","v":""},{"$f":"'Order Form'!K101 & \"\"","v":""},{"$f":"'Order Form'!$E$14","v":"YES"},{"$f":"'Order Form'!$E$19","v":0},{"$f":"'Order Form'!$E$16","v":"FREE gift card"},{"$f":"'Order Form'!$E$17","v":"No thanks"},"No","No",{"$f":"\"Dispatch Week: \"&'Order Form'!$E$18","v":"Dispatch Week: "},{"$f":"\"VIP: \"&'Order Form'!$E$5 &\"; Rib: \"&'Order Form'!$E$17 &\"; GT: \"&'Order Form'!$E$16","v":"VIP: ; Rib: No thanks; GT: FREE gift card"},null,null,null,{"$f":"IF(P81=\"\",\"\",IFERROR(INDIRECT(\"Postcodes!$C\"&SUMPRODUCT(--(Postcodes!$A$2:$A$100<=P81)*(Postcodes!$B$2:$B$100>=P81), ROW(Postcodes!$A$2:$A$100))),\"WRONG CODE\"))","v":0},null,null,null,null,null,null,""]
[{"$f":"'Order Form'!A102","v":81},{"$f":"'Order Form'!M102","v":""},{"$f":"'Order Form'!$E$4","v":0},{"$f":"'Order Form'!$E$5","v":0},{"$f":"'Order Form'!$E$6","v":0},{"$f":"'Order Form'!$E$7","v":0},{"$f":"'Order Form'!$E$9","v":0},{"$f":"'Order Form'!$E$8","v":0},{"$f":"'Order Form'!$E$10","v":0},{"$f":"'Order Form'!$E$11","v":0},{"$f":"IF(('Order Form'!$E$15=\"YES\"),'Order Form'!$E$12,\"\")","v":0},{"$f":"'Order Form'!$E$13 & \"\"","v":""},{"$f":"IF('Order Form'!D102=\"\",'Order Form'!C102,'Order Form'!D102) & \"\"","v":""},{"$f":"'Order Form'!E102 & \"\"","v":""},{"$f":"'Order Form'!F102","v":0},{"$f":"'Order Form'!I102","v":0},{"$f":"'Order Form'!G102","v":0},{"$f":"'Order Form'!H102","v":0},{"$f":"'Order Form'!J102 & \"\"","v":""},{"$f":"'Order Form'!L102 & \"\"","v":""},{"$f":"'Order Form'!C102 & \"\"","v":""},{"$f":"'Order Form'!K102 & \"\"","v":""},{"$f":"'Order Form'!$E$14","v":"YES"},{"$f":"'Order Form'!$E$19","v":0},{"$f":"'Order Form'!$E$16","v":"FREE gift card"},{"$f":"'Order Form'!$E$17","v":"No thanks"},"No","No",{"$f":"\"Dispatch Week: \"&'Order Form'!$E$18","v":"Dispatch Week: "},{"$f":"\"VIP: \"&'Order Form'!$E$5 &\"; Rib: \"&'Order Form'!$E$17 &\"; GT: \"&'Order Form'!$E$16","v":"VIP: ; Rib: No thanks; GT: FREE gift card"},null,null,null,{"$f":"IF(P82=\"\",\"\",IFERROR(INDIRECT(\"Postcodes!$C\"&SUMPRODUCT(--(Postcodes!$A$2:$A$100<=P82)*(Postcodes!$B$2:$B$100>=P82), ROW(Postcodes!$A$2:$A$100))),\"WRONG CODE\"))","v":0},null,null,null,null,null,null,""]
[{"$f":"'Order Form'!A103","v":82},{"$f":"'Order Form'!M103","v":""},{"$f":"'Order Form'!$E$4","v":0},{"$f":"'Order Form'!$E$5","v":0},{"$f":"'Order Form'!$E$6","v":0},{"$f":"'Order Form'!$E$7","v":0},{"$f":"'Order Form'!$E$9","v":0},{"$f":"'Order Form'!$E$8","v":0},{"$f":"'Order Form'!$E$10","v":0},{"$f":"'Order Form'!$E$11","v":0},{"$f":"IF(('Order Form'!$E$15=\"YES\"),'Order Form'!$E$12,\"\")","v":0},{"$f":"'Order Form'!$E$13 & \"\"","v":""},{"$f":"IF('Order Form'!D103=\"\",'Order Form'!C103,'Order Form'!D103) & \"\"","v":""},{"$f":"'Order Form'!E103 & \"\"","v":""},{"$f":"'Order Form'!F103","v":0},{"$f":"'Order Form'!I103","v":0},{"$f":"'Order Form'!G103","v":0},{"$f":"'Order Form'!H103","v":0},{"$f":"'Order Form'!J103 & \"\"","v":""},{"$f":"'Order Form'!L103 & \"\"","v":""},{"$f":"'Order Form'!C103 & \"\"","v":""},{"$f":"'Order Form'!K103 & \"\"","v":""},{"$f":"'Order Form'!$E$14","v":"YES"},{"$f":"'Order Form'!$E$19","v":0},{"$f":"'Order Form'!$E$16","v":"FREE gift card"},{"$f":"'Order Form'!$E$17","v":"No thanks"},"No","No",{"$f":"\"Dispatch Week: \"&'Order Form'!$E$18","v":"Dispatch Week: "},{"$f":"\"VIP: \"&'Order Form'!$E$5 &\"; Rib: \"&'Order Form'!$E$17 &\"; GT: \"&'Order Form'!$E$16","v":"VIP: ; Rib: No thanks; GT: FREE gift card"},null,null,null,{"$f":"IF(P83=\"\",\"\",IFERROR(INDIRECT(\"Postcodes!$C\"&SUMPRODUCT(--(Postcodes!$A$2:$A$100<=P83)*(Postcodes!$B$2:$B$100>=P83), ROW(Postcodes!$A$2:$A$100))),\"WRONG CODE\"))","v":0},null,null,null,null,null,null,""]
[{"$f":"'Order Form'!A104","v":83},{"$f":"'Order Form'!M104","v":""},{"$f":"'Order Form'!$E$4","v":0},{"$f":"'Order Form'!$E$5","v":0},{"$f":"'Order Form'!$E$6","v":0},{"$f":"'Order Form'!$E$7","v":0},{"$f":"'Order Form'!$E$9","v":0},{"$f":"'Order Form'!$E$8","v":0},{"$f":"'Order Form'!$E$10","v":0},{"$f":"'Order Form'!$E$11","v":0},{"$f":"IF(('Order Form'!$E$15=\"YES\"),'Order Form'!$E$12,\"\")","v":0},{"$f":"'Order Form'!$E$13 & \"\"","v":""},{"$f":"IF('Order Form'!D104=\"\",'Order Form'!C104,'Order Form'!D104) & \"\"","v":""},{"$f":"'Order Form'!E104 & \"\"","v":""},{"$f":"'Order Form'!F104","v":0},{"$f":"'Order Form'!I104","v":0},{"$f":"'Order Form'!G104","v":0},{"$f":"'Order Form'!H104","v":0},{"$f":"'Order Form'!J104 & \"\"","v":""},{"$f":"'Order Form'!L104 & \"\"","v":""},{"$f":"'Order Form'!C104 & \"\"","v":""},{"$f":"'Order Form'!K104 & \"\"","v":""},{"$f":"'Order Form'!$E$14","v":"YES"},{"$f":"'Order Form'!$E$19","v":0},{"$f":"'Order Form'!$E$16","v":"FREE gift card"},{"$f":"'Order Form'!$E$17","v":"No thanks"},"No","No",{"$f":"\"Dispatch Week: \"&'Order Form'!$E$18","v":"Dispatch Week: "},{"$f":"\"VIP: \"&'Order Form'!$E$5 &\"; Rib: \"&'Order Form'!$E$17 &\"; GT: \"&'Order Form'!$E$16","v":"VIP: ; Rib: No thanks; GT: FREE gift card"},null,null,null,{"$f":"IF(P84=\"\",\"\",IFERROR(INDIRECT(\"Postcodes!$C\"&SUMPRODUCT(--(Postcodes!$A$2:$A$100<=P84)*(Postcodes!$B$2:$B$100>=P84), ROW(Postcodes!$A$2:$A$100))),\"WRONG CODE\"))","v":0},null,null,null,null,null,null,""]
[{"$f":"'Order Form'!A105","v":84},{"$f":"'Order Form'!M105","v":""},{"$f":"'Order Form'!$E$4","v":0},{"$f":"'Order Form'!$E$5","v":0},{"$f":"'Order Form'!$E$6","v":0},{"$f":"'Order Form'!$E$7","v":0},{"$f":"'Order Form'!$E$9","v":0},{"$f":"'Order Form'!$E$8","v":0},{"$f":"'Order Form'!$E$10","v":0},{"$f":"'Order Form'!$E$11","v":0},{"$f":"IF(('Order Form'!$E$15=\"YES\"),'Order Form'!$E$12,\"\")","v":0},{"$f":"'Order Form'!$E$13 & \"\"","v":""},{"$f":"IF('Order Form'!D105=\"\",'Order Form'!C105,'Order Form'!D105) & \"\"","v":""},{"$f":"'Order Form'!E105 & \"\"","v":""},{"$f":"'Order Form'!F105","v":0},{"$f":"'Order Form'!I105","v":0},{"$f":"'Order Form'!G105","v":0},{"$f":"'Order Form'!H105","v":0},{"$f":"'Order Form'!J105 & \"\"","v":""},{"$f":"'Order Form'!L105 & \"\"","v":""},{"$f":"'Order Form'!C105 & \"\"","v":""},{"$f":"'Order Form'!K105 & \"\"","v":""},{"$f":"'Order Form'!$E$14","v":"YES"},{"$f":"'Order Form'!$E$19","v":0},{"$f":"'Order Form'!$E$16","v":"FREE gift card"},{"$f":"'Order Form'!$E$17","v":"No thanks"},"No","No",{"$f":"\"Dispatch Week: \"&'Order Form'!$E$18","v":"Dispatch Week: "},{"$f":"\"VIP: \"&'Order Form'!$E$5 &\"; Rib: \"&'Order Form'!$E$17 &\"; GT: \"&'Order Form'!$E$16","v":"VIP: ; Rib: No thanks; GT: FREE gift card"},null,null,null,{"$f":"IF(P85=\"\",\"\",IFERROR(INDIRECT(\"Postcodes!$C\"&SUMPRODUCT(--(Postcodes!$A$2:$A$100<=P85)*(Postcodes!$B$2:$B$100>=P85), ROW(Postcodes!$A$2:$A$100))),\"WRONG CODE\"))","v":0},null,null,null,null,null,null,""]
[{"$f":"'Order Form'!A106","v":85},{"$f":"'Order Form'!M106","v":""},{"$f":"'Order Form'!$E$4","v":0},{"$f":"'Order Form'!$E$5","v":0},{"$f":"'Order Form'!$E$6","v":0},{"$f":"'Order Form'!$E$7","v":0},{"$f":"'Order Form'!$E$9","v":0},{"$f":"'Order Form'!$E$8","v":0},{"$f":"'Order Form'!$E$10","v":0},{"$f":"'Order Form'!$E$11","v":0},{"$f":"IF(('Order Form'!$E$15=\"YES\"),'Order Form'!$E$12,\"\")","v":0},{"$f":"'Order Form'!$E$13 & \"\"","v":""},{"$f":"IF('Order Form'!D106=\"\",'Order Form'!C106,'Order Form'!D106) & \"\"","v":""},{"$f":"'Order Form'!E106 & \"\"","v":""},{"$f":"'Order Form'!F106","v":0},{"$f":"'Order Form'!I106","v":0},{"$f":"'Order Form'!G106","v":0},{"$f":"'Order Form'!H106","v":0},{"$f":"'Order Form'!J106 & \"\"","v":""},{"$f":"'Order Form'!L106 & \"\"","v":""},{"$f":"'Order Form'!C106 & \"\"","v":""},{"$f":"'Order Form'!K106 & \"\"","v":""},{"$f":"'Order Form'!$E$14","v":"YES"},{"$f":"'Order Form'!$E$19","v":0},{"$f":"'Order Form'!$E$16","v":"FREE gift card"},{"$f":"'Order Form'!$E$17","v":"No thanks"},"No","No",{"$f":"\"Dispatch Week: \"&'Order Form'!$E$18","v":"Dispatch Week: "},{"$f":"\"VIP: \"&'Order Form'!$E$5 &\"; Rib: \"&'Order Form'!$E$17 &\"; GT: \"&'Order Form'!$E$16","v":"VIP: ; Rib: No thanks; GT: FREE gift card"},null,null,null,{"$f":"IF(P86=\"\",\"\",IFERROR(INDIRECT(\"Postcodes!$C\"&SUMPRODUCT(--(Postcodes!$A$2:$A$100<=P86)*(Postcodes!$B$2:$B$100>=P86), ROW(Postcodes!$A$2:$A$100))),\"WRONG CODE\"))","v":0},null,null,null,null,null,null,""]
[{"$f":"'Order Form'!A107","v":86},{"$f":"'Order Form'!M107","v":""},{"$f":"'Order Form'!$E$4","v":0},{"$f":"'Order Form'!$E$5","v":0},{"$f":"'Order Form'!$E$6","v":0},{"$f":"'Order Form'!$E$7","v":0},{"$f":"'Order Form'!$E$9","v":0},{"$f":"'Order Form'!$E$8","v":0},{"$f":"'Order Form'!$E$10","v":0},{"$f":"'Order Form'!$E$11","v":0},{"$f":"IF(('Order Form'!$E$15=\"YES\"),'Order Form'!$E$12,\"\")","v":0},{"$f":"'Order Form'!$E$13 & \"\"","v":""},{"$f":"IF('Order Form'!D107=\"\",'Order Form'!C107,'Order Form'!D107) & \"\"","v":""},{"$f":"'Order Form'!E107 & \"\"","v":""},{"$f":"'Order Form'!F107","v":0},{"$f":"'Order Form'!I107","v":0},{"$f":"'Order Form'!G107","v":0},{"$f":"'Order Form'!H107","v":0},{"$f":"'Order Form'!J107 & \"\"","v":""},{"$f":"'Order Form'!L107 & \"\"","v":""},{"$f":"'Order Form'!C107 & \"\"","v":""},{"$f":"'Order Form'!K107 & \"\"","v":""},{"$f":"'Order Form'!$E$14","v":"YES"},{"$f":"'Order Form'!$E$19","v":0},{"$f":"'Order Form'!$E$16","v":"FREE gift card"},{"$f":"'Order Form'!$E$17","v":"No thanks"},"No","No",{"$f":"\"Dispatch Week: \"&'Order Form'!$E$18","v":"Dispatch Week: "},{"$f":"\"VIP: \"&'Order Form'!$E$5 &\"; Rib: \"&'Order Form'!$E$17 &\"; GT: \"&'Order Form'!$E$16","v":"VIP: ; Rib: No thanks; GT: FREE gift card"},null,null,null,{"$f":"IF(P87=\"\",\"\",IFERROR(INDIRECT(\"Postcodes!$C\"&SUMPRODUCT(--(Postcodes!$A$2:$A$100<=P87)*(Postcodes!$B$2:$B$100>=P87), ROW(Postcodes!$A$2:$A$100))),\"WRONG CODE\"))","v":0},null,null,null,null,null,null,""]
[{"$f":"'Order Form'!A108","v":87},{"$f":"'Order Form'!M108","v":""},{"$f":"'Order Form'!$E$4","v":0},{"$f":"'Order Form'!$E$5","v":0},{"$f":"'Order Form'!$E$6","v":0},{"$f":"'Order Form'!$E$7","v":0},{"$f":"'Order Form'!$E$9","v":0},{"$f":"'Order Form'!$E$8","v":0},{"$f":"'Order Form'!$E$10","v":0},{"$f":"'Order Form'!$E$11","v":0},{"$f":"IF(('Order Form'!$E$15=\"YES\"),'Order Form'!$E$12,\"\")","v":0},{"$f":"'Order Form'!$E$13 & \"\"","v":""},{"$f":"IF('Order Form'!D108=\"\",'Order Form'!C108,'Order Form'!D108) & \"\"","v":""},{"$f":"'Order Form'!E108 & \"\"","v":""},{"$f":"'Order Form'!F108","v":0},{"$f":"'Order Form'!I108","v":0},{"$f":"'Order Form'!G108","v":0},{"$f":"'Order Form'!H108","v":0},{"$f":"'Order Form'!J108 & \"\"","v":""},{"$f":"'Order Form'!L108 & \"\"","v":""},{"$f":"'Order Form'!C108 & \"\"","v":""},{"$f":"'Order Form'!K108 & \"\"","v":""},{"$f":"'Order Form'!$E$14","v":"YES"},{"$f":"'Order Form'!$E$19","v":0},{"$f":"'Order Form'!$E$16","v":"FREE gift card"},{"$f":"'Order Form'!$E$17","v":"No thanks"},"No","No",{"$f":"\"Dispatch Week: \"&'Order Form'!$E$18","v":"Dispatch Week: "},{"$f":"\"VIP: \"&'Order Form'!$E$5 &\"; Rib: \"&'Order Form'!$E$17 &\"; GT: \"&'Order Form'!$E$16","v":"VIP: ; Rib: No thanks; GT: FREE gift card"},null,null,null,{"$f":"IF(P88=\"\",\"\",IFERROR(INDIRECT(\"Postcodes!$C\"&SUMPRODUCT(--(Postcodes!$A$2:$A$100<=P88)*(Postcodes!$B$2:$B$100>=P88), ROW(Postcodes!$A$2:$A$100))),\"WRONG CODE\"))","v":0},null,null,null,null,null,null,""]
[{"$f":"'Order Form'!A109","v":88},{"$f":"'Order Form'!M109","v":""},{"$f":"'Order Form'!$E$4","v":0},{"$f":"'Order Form'!$E$5","v":0},{"$f":"'Order Form'!$E$6","v":0},{"$f":"'Order Form'!$E$7","v":0},{"$f":"'Order Form'!$E$9","v":0},{"$f":"'Order Form'!$E$8","v":0},{"$f":"'Order Form'!$E$10","v":0},{"$f":"'Order Form'!$E$11","v":0},{"$f":"IF(('Order Form'!$E$15=\"YES\"),'Order Form'!$E$12,\"\")","v":0},{"$f":"'Order Form'!$E$13 & \"\"","v":""},{"$f":"IF('Order Form'!D109=\"\",'Order Form'!C109,'Order Form'!D109) & \"\"","v":""},{"$f":"'Order Form'!E109 & \"\"","v":""},{"$f":"'Order Form'!F109","v":0},{"$f":"'Order Form'!I109","v":0},{"$f":"'Order Form'!G109","v":0},{"$f":"'Order Form'!H109","v":0},{"$f":"'Order Form'!J109 & \"\"","v":""},{"$f":"'Order Form'!L109 & \"\"","v":""},{"$f":"'Order Form'!C109 & \"\"","v":""},{"$f":"'Order Form'!K109 & \"\"","v":""},{"$f":"'Order Form'!$E$14","v":"YES"},{"$f":"'Order Form'!$E$19","v":0},{"$f":"'Order Form'!$E$16","v":"FREE gift card"},{"$f":"'Order Form'!$E$17","v":"No thanks"},"No","No",{"$f":"\"Dispatch Week: \"&'Order Form'!$E$18","v":"Dispatch Week: "},{"$f":"\"VIP: \"&'Order Form'!$E$5 &\"; Rib: \"&'Order Form'!$E$17 &\"; GT: \"&'Order Form'!$E$16","v":"VIP: ; Rib: No thanks; GT: FREE gift card"},null,null,null,{"$f":"IF(P89=\"\",\"\",IFERROR(INDIRECT(\"Postcodes!$C\"&SUMPRODUCT(--(Postcodes!$A$2:$A$100<=P89)*(Postcodes!$B$2:$B$100>=P89), ROW(Postcodes!$A$2:$A$100))),\"WRONG CODE\"))","v":0},null,null,null,null,null,null,""]
[{"$f":"'Order Form'!A110","v":89},{"$f":"'Order Form'!M110","v":""},{"$f":"'Order Form'!$E$4","v":0},{"$f":"'Order Form'!$E$5","v":0},{"$f":"'Order Form'!$E$6","v":0},{"$f":"'Order Form'!$E$7","v":0},{"$f":"'Order Form'!$E$9","v":0},{"$f":"'Order Form'!$E$8","v":0},{"$f":"'Order Form'!$E$10","v":0},{"$f":"'Order Form'!$E$11","v":0},{"$f":"IF(('Order Form'!$E$15=\"YES\"),'Order Form'!$E$12,\"\")","v":0},{"$f":"'Order Form'!$E$13 & \"\"","v":""},{"$f":"IF('Order Form'!D110=\"\",'Order Form'!C110,'Order Form'!D110) & \"\"","v":""},{"$f":"'Order Form'!E110 & \"\"","v":""},{"$f":"'Order Form'!F110","v":0},{"$f":"'Order Form'!I110","v":0},{"$f":"'Order Form'!G110","v":0},{"$f":"'Order Form'!H110","v":0},{"$f":"'Order Form'!J110 & \"\"","v":""},{"$f":"'Order Form'!L110 & \"\"","v":""},{"$f":"'Order Form'!C110 & \"\"","v":""},{"$f":"'Order Form'!K110 & \"\"","v":""},{"$f":"'Order Form'!$E$14","v":"YES"},{"$f":"'Order Form'!$E$19","v":0},{"$f":"'Order Form'!$E$16","v":"FREE gift card"},{"$f":"'Order Form'!$E$17","v":"No thanks"},"No","No",{"$f":"\"Dispatch Week: \"&'Order Form'!$E$18","v":"Dispatch Week: "},{"$f":"\"VIP: \"&'Order Form'!$E$5 &\"; Rib: \"&'Order Form'!$E$17 &\"; GT: \"&'Order Form'!$E$16","v":"VIP: ; Rib: No thanks; GT: FREE gift card"},null,null,null,{"$f":"IF(P90=\"\",\"\",IFERROR(INDIRECT(\"Postcodes!$C\"&SUMPRODUCT(--(Postcodes!$A$2:$A$100<=P90)*(Postcodes!$B$2:$B$100>=P90), ROW(Postcodes!$A$2:$A$100))),\"WRONG CODE\"))","v":0},null,null,null,null,null,null,""]
[{"$f":"'Order Form'!A111","v":90},{"$f":"'Order Form'!M111","v":""},{"$f":"'Order Form'!$E$4","v":0},{"$f":"'Order Form'!$E$5","v":0},{"$f":"'Order Form'!$E$6","v":0},{"$f":"'Order Form'!$E$7","v":0},{"$f":"'Order Form'!$E$9","v":0},{"$f":"'Order Form'!$E$8","v":0},{"$f":"'Order Form'!$E$10","v":0},{"$f":"'Order Form'!$E$11","v":0},{"$f":"IF(('Order Form'!$E$15=\"YES\"),'Order Form'!$E$12,\"\")","v":0},{"$f":"'Order Form'!$E$13 & \"\"","v":""},{"$f":"IF('Order Form'!D111=\"\",'Order Form'!C111,'Order Form'!D111) & \"\"","v":""},{"$f":"'Order Form'!E111 & \"\"","v":""},{"$f":"'Order Form'!F111","v":0},{"$f":"'Order Form'!I111","v":0},{"$f":"'Order Form'!G111","v":0},{"$f":"'Order Form'!H111","v":0},{"$f":"'Order Form'!J111 & \"\"","v":""},{"$f":"'Order Form'!L111 & \"\"","v":""},{"$f":"'Order Form'!C111 & \"\"","v":""},{"$f":"'Order Form'!K111 & \"\"","v":""},{"$f":"'Order Form'!$E$14","v":"YES"},{"$f":"'Order Form'!$E$19","v":0},{"$f":"'Order Form'!$E$16","v":"FREE gift card"},{"$f":"'Order Form'!$E$17","v":"No thanks"},"No","No",{"$f":"\"Dispatch Week: \"&'Order Form'!$E$18","v":"Dispatch Week: "},{"$f":"\"VIP: \"&'Order Form'!$E$5 &\"; Rib: \"&'Order Form'!$E$17 &\"; GT: \"&'Order Form'!$E$16","v":"VIP: ; Rib: No thanks; GT: FREE gift card"},null,null,null,{"$f":"IF(P91=\"\",\"\",IFERROR(INDIRECT(\"Postcodes!$C\"&SUMPRODUCT(--(Postcodes!$A$2:$A$100<=P91)*(Postcodes!$B$2:$B$100>=P91), ROW(Postcodes!$A$2:$A$100))),\"WRONG CODE\"))","v":0},null,null,null,null,null,null,""]
[{"$f":"'Order Form'!A112","v":91},{"$f":"'Order Form'!M112","v":""},{"$f":"'Order Form'!$E$4","v":0},{"$f":"'Order Form'!$E$5","v":0},{"$f":"'Order Form'!$E$6","v":0},{"$f":"'Order Form'!$E$7","v":0},{"$f":"'Order Form'!$E$9","v":0},{"$f":"'Order Form'!$E$8","v":0},{"$f":"'Order Form'!$E$10","v":0},{"$f":"'Order Form'!$E$11","v":0},{"$f":"IF(('Order Form'!$E$15=\"YES\"),'Order Form'!$E$12,\"\")","v":0},{"$f":"'Order Form'!$E$13 & \"\"","v":""},{"$f":"IF('Order Form'!D112=\"\",'Order Form'!C112,'Order Form'!D112) & \"\"","v":""},{"$f":"'Order Form'!E112 & \"\"","v":""},{"$f":"'Order Form'!F112","v":0},{"$f":"'Order Form'!I112","v":0},{"$f":"'Order Form'!G112","v":0},{"$f":"'Order Form'!H112","v":0},{"$f":"'Order Form'!J112 & \"\"","v":""},{"$f":"'Order Form'!L112 & \"\"","v":""},{"$f":"'Order Form'!C112 & \"\"","v":""},{"$f":"'Order Form'!K112 & \"\"","v":""},{"$f":"'Order Form'!$E$14","v":"YES"},{"$f":"'Order Form'!$E$19","v":0},{"$f":"'Order Form'!$E$16","v":"FREE gift card"},{"$f":"'Order Form'!$E$17","v":"No thanks"},"No","No",{"$f":"\"Dispatch Week: \"&'Order Form'!$E$18","v":"Dispatch Week: "},{"$f":"\"VIP: \"&'Order Form'!$E$5 &\"; Rib: \"&'Order Form'!$E$17 &\"; GT: \"&'Order Form'!$E$16","v":"VIP: ; Rib: No thanks; GT: FREE gift card"},null,null,null,{"$f":"IF(P92=\"\",\"\",IFERROR(INDIRECT(\"Postcodes!$C\"&SUMPRODUCT(--(Postcodes!$A$2:$A$100<=P92)*(Postcodes!$B$2:$B$100>=P92), ROW(Postcodes!$A$2:$A$100))),\"WRONG CODE\"))","v":0},null,null,null,null,null,null,""]
[{"$f":"'Order Form'!A113","v":92},{"$f":"'Order Form'!M113","v":""},{"$f":"'Order Form'!$E$4","v":0},{"$f":"'Order Form'!$E$5","v":0},{"$f":"'Order Form'!$E$6","v":0},{"$f":"'Order Form'!$E$7","v":0},{"$f":"'Order Form'!$E$9","v":0},{"$f":"'Order Form'!$E$8","v":0},{"$f":"'Order Form'!$E$10","v":0},{"$f":"'Order Form'!$E$11","v":0},{"$f":"IF(('Order Form'!$E$15=\"YES\"),'Order Form'!$E$12,\"\")","v":0},{"$f":"'Order Form'!$E$13 & \"\"","v":""},{"$f":"IF('Order Form'!D113=\"\",'Order Form'!C113,'Order Form'!D113) & \"\"","v":""},{"$f":"'Order Form'!E113 & \"\"","v":""},{"$f":"'Order Form'!F113","v":0},{"$f":"'Order Form'!I113","v":0},{"$f":"'Order Form'!G113","v":0},{"$f":"'Order Form'!H113","v":0},{"$f":"'Order Form'!J113 & \"\"","v":""},{"$f":"'Order Form'!L113 & \"\"","v":""},{"$f":"'Order Form'!C113 & \"\"","v":""},{"$f":"'Order Form'!K113 & \"\"","v":""},{"$f":"'Order Form'!$E$14","v":"YES"},{"$f":"'Order Form'!$E$19","v":0},{"$f":"'Order Form'!$E$16","v":"FREE gift card"},{"$f":"'Order Form'!$E$17","v":"No thanks"},"No","No",{"$f":"\"Dispatch Week: \"&'Order Form'!$E$18","v":"Dispatch Week: "},{"$f":"\"VIP: \"&'Order Form'!$E$5 &\"; Rib: \"&'Order Form'!$E$17 &\"; GT: \"&'Order Form'!$E$16","v":"VIP: ; Rib: No thanks; GT: FREE gift card"},null,null,null,{"$f":"IF(P93=\"\",\"\",IFERROR(INDIRECT(\"Postcodes!$C\"&SUMPRODUCT(--(Postcodes!$A$2:$A$100<=P93)*(Postcodes!$B$2:$B$100>=P93), ROW(Postcodes!$A$2:$A$100))),\"WRONG CODE\"))","v":0},null,null,null,null,null,null,""]
[{"$f":"'Order Form'!A114","v":93},{"$f":"'Order Form'!M114","v":""},{"$f":"'Order Form'!$E$4","v":0},{"$f":"'Order Form'!$E$5","v":0},{"$f":"'Order Form'!$E$6","v":0},{"$f":"'Order Form'!$E$7","v":0},{"$f":"'Order Form'!$E$9","v":0},{"$f":"'Order Form'!$E$8","v":0},{"$f":"'Order Form'!$E$10","v":0},{"$f":"'Order Form'!$E$11","v":0},{"$f":"IF(('Order Form'!$E$15=\"YES\"),'Order Form'!$E$12,\"\")","v":0},{"$f":"'Order Form'!$E$13 & \"\"","v":""},{"$f":"IF('Order Form'!D114=\"\",'Order Form'!C114,'Order Form'!D114) & \"\"","v":""},{"$f":"'Order Form'!E114 & \"\"","v":""},{"$f":"'Order Form'!F114","v":0},{"$f":"'Order Form'!I114","v":0},{"$f":"'Order Form'!G114","v":0},{"$f":"'Order Form'!H114","v":0},{"$f":"'Order Form'!J114 & \"\"","v":""},{"$f":"'Order Form'!L114 & \"\"","v":""},{"$f":"'Order Form'!C114 & \"\"","v":""},{"$f":"'Order Form'!K114 & \"\"","v":""},{"$f":"'Order Form'!$E$14","v":"YES"},{"$f":"'Order Form'!$E$19","v":0},{"$f":"'Order Form'!$E$16","v":"FREE gift card"},{"$f":"'Order Form'!$E$17","v":"No thanks"},"No","No",{"$f":"\"Dispatch Week: \"&'Order Form'!$E$18","v":"Dispatch Week: "},{"$f":"\"VIP: \"&'Order Form'!$E$5 &\"; Rib: \"&'Order Form'!$E$17 &\"; GT: \"&'Order Form'!$E$16","v":"VIP: ; Rib: No thanks; GT: FREE gift card"},null,null,null,{"$f":"IF(P94=\"\",\"\",IFERROR(INDIRECT(\"Postcodes!$C\"&SUMPRODUCT(--(Postcodes!$A$2:$A$100<=P94)*(Postcodes!$B$2:$B$100>=P94), ROW(Postcodes!$A$2:$A$100))),\"WRONG CODE\"))","v":0},null,null,null,null,null,null,""]
[{"$f":"'Order Form'!A115","v":94},{"$f":"'Order Form'!M115","v":""},{"$f":"'Order Form'!$E$4","v":0},{"$f":"'Order Form'!$E$5","v":0},{"$f":"'Order Form'!$E$6","v":0},{"$f":"'Order Form'!$E$7","v":0},{"$f":"'Order Form'!$E$9","v":0},{"$f":"'Order Form'!$E$8","v":0},{"$f":"'Order Form'!$E$10","v":0},{"$f":"'Order Form'!$E$11","v":0},{"$f":"IF(('Order Form'!$E$15=\"YES\"),'Order Form'!$E$12,\"\")","v":0},{"$f":"'Order Form'!$E$13 & \"\"","v":""},{"$f":"IF('Order Form'!D115=\"\",'Order Form'!C115,'Order Form'!D115) & \"\"","v":""},{"$f":"'Order Form'!E115 & \"\"","v":""},{"$f":"'Order Form'!F115","v":0},{"$f":"'Order Form'!I115","v":0},{"$f":"'Order Form'!G115","v":0},{"$f":"'Order Form'!H115","v":0},{"$f":"'Order Form'!J115 & \"\"","v":""},{"$f":"'Order Form'!L115 & \"\"","v":""},{"$f":"'Order Form'!C115 & \"\"","v":""},{"$f":"'Order Form'!K115 & \"\"","v":""},{"$f":"'Order Form'!$E$14","v":"YES"},{"$f":"'Order Form'!$E$19","v":0},{"$f":"'Order Form'!$E$16","v":"FREE gift card"},{"$f":"'Order Form'!$E$17","v":"No thanks"},"No","No",{"$f":"\"Dispatch Week: \"&'Order Form'!$E$18","v":"Dispatch Week: "},{"$f":"\"VIP: \"&'Order Form'!$E$5 &\"; Rib: \"&'Order Form'!$E$17 &\"; GT: \"&'Order Form'!$E$16","v":"VIP: ; Rib: No thanks; GT: FREE gift card"},null,null,null,{"$f":"IF(P95=\"\",\"\",IFERROR(INDIRECT(\"Postcodes!$C\"&SUMPRODUCT(--(Postcodes!$A$2:$A$100<=P95)*(Postcodes!$B$2:$B$100>=P95), ROW(Postcodes!$A$2:$A$100))),\"WRONG CODE\"))","v":0},null,null,null,null,null,null,""]
[{"$f":"'Order Form'!A116","v":95},{"$f":"'Order Form'!M116","v":""},{"$f":"'Order Form'!$E$4","v":0},{"$f":"'Order Form'!$E$5","v":0},{"$f":"'Order Form'!$E$6","v":0},{"$f":"'Order Form'!$E$7","v":0},{"$f":"'Order Form'!$E$9","v":0},{"$f":"'Order Form'!$E$8","v":0},{"$f":"'Order Form'!$E$10","v":0},{"$f":"'Order Form'!$E$11","v":0},{"$f":"IF(('Order Form'!$E$15=\"YES\"),'Order Form'!$E$12,\"\")","v":0},{"$f":"'Order Form'!$E$13 & \"\"","v":""},{"$f":"IF('Order Form'!D116=\"\",'Order Form'!C116,'Order Form'!D116) & \"\"","v":""},{"$f":"'Order Form'!E116 & \"\"","v":""},{"$f":"'Order Form'!F116","v":0},{"$f":"'Order Form'!I116","v":0},{"$f":"'Order Form'!G116","v":0},{"$f":"'Order Form'!H116","v":0},{"$f":"'Order Form'!J116 & \"\"","v":""},{"$f":"'Order Form'!L116 & \"\"","v":""},{"$f":"'Order Form'!C116 & \"\"","v":""},{"$f":"'Order Form'!K116 & \"\"","v":""},{"$f":"'Order Form'!$E$14","v":"YES"},{"$f":"'Order Form'!$E$19","v":0},{"$f":"'Order Form'!$E$16","v":"FREE gift card"},{"$f":"'Order Form'!$E$17","v":"No thanks"},"No","No",{"$f":"\"Dispatch Week: \"&'Order Form'!$E$18","v":"Dispatch Week: "},{"$f":"\"VIP: \"&'Order Form'!$E$5 &\"; Rib: \"&'Order Form'!$E$17 &\"; GT: \"&'Order Form'!$E$16","v":"VIP: ; Rib: No thanks; GT: FREE gift card"},null,null,null,{"$f":"IF(P96=\"\",\"\",IFERROR(INDIRECT(\"Postcodes!$C\"&SUMPRODUCT(--(Postcodes!$A$2:$A$100<=P96)*(Postcodes!$B$2:$B$100>=P96), ROW(Postcodes!$A$2:$A$100))),\"WRONG CODE\"))","v":0},null,null,null,null,null,null,""]
[{"$f":"'Order Form'!A117","v":96},{"$f":"'Order Form'!M117","v":""},{"$f":"'Order Form'!$E$4","v":0},{"$f":"'Order Form'!$E$5","v":0},{"$f":"'Order Form'!$E$6","v":0},{"$f":"'Order Form'!$E$7","v":0},{"$f":"'Order Form'!$E$9","v":0},{"$f":"'Order Form'!$E$8","v":0},{"$f":"'Order Form'!$E$10","v":0},{"$f":"'Order Form'!$E$11","v":0},{"$f":"IF(('Order Form'!$E$15=\"YES\"),'Order Form'!$E$12,\"\")","v":0},{"$f":"'Order Form'!$E$13 & \"\"","v":""},{"$f":"IF('Order Form'!D117=\"\",'Order Form'!C117,'Order Form'!D117) & \"\"","v":""},{"$f":"'Order Form'!E117 & \"\"","v":""},{"$f":"'Order Form'!F117","v":0},{"$f":"'Order Form'!I117","v":0},{"$f":"'Order Form'!G117","v":0},{"$f":"'Order Form'!H117","v":0},{"$f":"'Order Form'!J117 & \"\"","v":""},{"$f":"'Order Form'!L117 & \"\"","v":""},{"$f":"'Order Form'!C117 & \"\"","v":""},{"$f":"'Order Form'!K117 & \"\"","v":""},{"$f":"'Order Form'!$E$14","v":"YES"},{"$f":"'Order Form'!$E$19","v":0},{"$f":"'Order Form'!$E$16","v":"FREE gift card"},{"$f":"'Order Form'!$E$17","v":"No thanks"},"No","No",{"$f":"\"Dispatch Week: \"&'Order Form'!$E$18","v":"Dispatch Week: "},{"$f":"\"VIP: \"&'Order Form'!$E$5 &\"; Rib: \"&'Order Form'!$E$17 &\"; GT: \"&'Order Form'!$E$16","v":"VIP: ; Rib: No thanks; GT: FREE gift card"},null,null,null,{"$f":"IF(P97=\"\",\"\",IFERROR(INDIRECT(\"Postcodes!$C\"&SUMPRODUCT(--(Postcodes!$A$2:$A$100<=P97)*(Postcodes!$B$2:$B$100>=P97), ROW(Postcodes!$A$2:$A$100))),\"WRONG CODE\"))","v":0},null,null,null,null,null,null,""]
[{"$f":"'Order Form'!A118","v":97},{"$f":"'Order Form'!M118","v":""},{"$f":"'Order Form'!$E$4","v":0},{"$f":"'Order Form'!$E$5","v":0},{"$f":"'Order Form'!$E$6","v":0},{"$f":"'Order Form'!$E$7","v":0},{"$f":"'Order Form'!$E$9","v":0},{"$f":"'Order Form'!$E$8","v":0},{"$f":"'Order Form'!$E$10","v":0},{"$f":"'Order Form'!$E$11","v":0},{"$f":"IF(('Order Form'!$E$15=\"YES\"),'Order Form'!$E$12,\"\")","v":0},{"$f":"'Order Form'!$E$13 & \"\"","v":""},{"$f":"IF('Order Form'!D118=\"\",'Order Form'!C118,'Order Form'!D118) & \"\"","v":""},{"$f":"'Order Form'!E118 & \"\"","v":""},{"$f":"'Order Form'!F118","v":0},{"$f":"'Order Form'!I118","v":0},{"$f":"'Order Form'!G118","v":0},{"$f":"'Order Form'!H118","v":0},{"$f":"'Order Form'!J118 & \"\"","v":""},{"$f":"'Order Form'!L118 & \"\"","v":""},{"$f":"'Order Form'!C118 & \"\"","v":""},{"$f":"'Order Form'!K118 & \"\"","v":""},{"$f":"'Order Form'!$E$14","v":"YES"},{"$f":"'Order Form'!$E$19","v":0},{"$f":"'Order Form'!$E$16","v":"FREE gift card"},{"$f":"'Order Form'!$E$17","v":"No thanks"},"No","No",{"$f":"\"Dispatch Week: \"&'Order Form'!$E$18","v":"Dispatch Week: "},{"$f":"\"VIP: \"&'Order Form'!$E$5 &\"; Rib: \"&'Order Form'!$E$17 &\"; GT: \"&'Order Form'!$E$16","v":"VIP: ; Rib: No thanks; GT: FREE gift card"},null,null,null,{"$f":"IF(P98=\"\",\"\",IFERROR(INDIRECT(\"Postcodes!$C\"&SUMPRODUCT(--(Postcodes!$A$2:$A$100<=P98)*(Postcodes!$B$2:$B$100>=P98), ROW(Postcodes!$A$2:$A$100))),\"WRONG CODE\"))","v":0},null,null,null,null,null,null,""]
[{"$f":"'Order Form'!A119","v":98},{"$f":"'Order Form'!M119","v":""},{"$f":"'Order Form'!$E$4","v":0},{"$f":"'Order Form'!$E$5","v":0},{"$f":"'Order Form'!$E$6","v":0},{"$f":"'Order Form'!$E$7","v":0},{"$f":"'Order Form'!$E$9","v":0},{"$f":"'Order Form'!$E$8","v":0},{"$f":"'Order Form'!$E$10","v":0},{"$f":"'Order Form'!$E$11","v":0},{"$f":"IF(('Order Form'!$E$15=\"YES\"),'Order Form'!$E$12,\"\")","v":0},{"$f":"'Order Form'!$E$13 & \"\"","v":""},{"$f":"IF('Order Form'!D119=\"\",'Order Form'!C119,'Order Form'!D119) & \"\"","v":""},{"$f":"'Order Form'!E119 & \"\"","v":""},{"$f":"'Order Form'!F119","v":0},{"$f":"'Order Form'!I119","v":0},{"$f":"'Order Form'!G119","v":0},{"$f":"'Order Form'!H119","v":0},{"$f":"'Order Form'!J119 & \"\"","v":""},{"$f":"'Order Form'!L119 & \"\"","v":""},{"$f":"'Order Form'!C119 & \"\"","v":""},{"$f":"'Order Form'!K119 & \"\"","v":""},{"$f":"'Order Form'!$E$14","v":"YES"},{"$f":"'Order Form'!$E$19","v":0},{"$f":"'Order Form'!$E$16","v":"FREE gift card"},{"$f":"'Order Form'!$E$17","v":"No thanks"},"No","No",{"$f":"\"Dispatch Week: \"&'Order Form'!$E$18","v":"Dispatch Week: "},{"$f":"\"VIP: \"&'Order Form'!$E$5 &\"; Rib: \"&'Order Form'!$E$17 &\"; GT: \"&'Order Form'!$E$16","v":"VIP: ; Rib: No thanks; GT: FREE gift card"},null,null,null,{"$f":"IF(P99=\"\",\"\",IFERROR(INDIRECT(\"Postcodes!$C\"&SUMPRODUCT(--(Postcodes!$A$2:$A$100<=P99)*(Postcodes!$B$2:$B$100>=P99), ROW(Postcodes!$A$2:$A$100))),\"WRONG CODE\"))","v":0},null,null,null,null,null,null,""]
[{"$f":"'Order Form'!A120","v":99},{"$f":"'Order Form'!M120","v":""},{"$f":"'Order Form'!$E$4","v":0},{"$f":"'Order Form'!$E$5","v":0},{"$f":"'Order Form'!$E$6","v":0},{"$f":"'Order Form'!$E$7","v":0},{"$f":"'Order Form'!$E$9","v":0},{"$f":"'Order Form'!$E$8","v":0},{"$f":"'Order Form'!$E$10","v":0},{"$f":"'Order Form'!$E$11","v":0},{"$f":"IF(('Order Form'!$E$15=\"YES\"),'Order Form'!$E$12,\"\")","v":0},{"$f":"'Order Form'!$E$13 & \"\"","v":""},{"$f":"IF('Order Form'!D120=\"\",'Order Form'!C120,'Order Form'!D120) & \"\"","v":""},{"$f":"'Order Form'!E120 & \"\"","v":""},{"$f":"'Order Form'!F120","v":0},{"$f":"'Order Form'!I120","v":0},{"$f":"'Order Form'!G120","v":0},{"$f":"'Order Form'!H120","v":0},{"$f":"'Order Form'!J120 & \"\"","v":""},{"$f":"'Order Form'!L120 & \"\"","v":""},{"$f":"'Order Form'!C120 & \"\"","v":""},{"$f":"'Order Form'!K120 & \"\"","v":""},{"$f":"'Order Form'!$E$14","v":"YES"},{"$f":"'Order Form'!$E$19","v":0},{"$f":"'Order Form'!$E$16","v":"FREE gift card"},{"$f":"'Order Form'!$E$17","v":"No thanks"},"No","No",{"$f":"\"Dispatch Week: \"&'Order Form'!$E$18","v":"Dispatch Week: "},{"$f":"\"VIP: \"&'Order Form'!$E$5 &\"; Rib: \"&'Order Form'!$E$17 &\"; GT: \"&'Order Form'!$E$16","v":"VIP: ; Rib: No thanks; GT: FREE gift card"},null,null,null,{"$f":"IF(P100=\"\",\"\",IFERROR(INDIRECT(\"Postcodes!$C\"&SUMPRODUCT(--(Postcodes!$A$2:$A$100<=P100)*(Postcodes!$B$2:$B$100>=P100), ROW(Postcodes!$A$2:$A$100))),\"WRONG CODE\"))","v":0},null,null,null,null,null,null,""]
[{"$f":"'Order Form'!A121","v":100},{"$f":"'Order Form'!M121","v":""},{"$f":"'Order Form'!$E$4","v":0},{"$f":"'Order Form'!$E$5","v":0},{"$f":"'Order Form'!$E$6","v":0},{"$f":"'Order Form'!$E$7","v":0},{"$f":"'Order Form'!$E$9","v":0},{"$f":"'Order Form'!$E$8","v":0},{"$f":"'Order Form'!$E$10","v":0},{"$f":"'Order Form'!$E$11","v":0},{"$f":"IF(('Order Form'!$E$15=\"YES\"),'Order Form'!$E$12,\"\")","v":0},{"$f":"'Order Form'!$E$13 & \"\"","v":""},{"$f":"IF('Order Form'!D121=\"\",'Order Form'!C121,'Order Form'!D121) & \"\"","v":""},{"$f":"'Order Form'!E121 & \"\"","v":""},{"$f":"'Order Form'!F121","v":0},{"$f":"'Order Form'!I121","v":0},{"$f":"'Order Form'!G121","v":0},{"$f":"'Order Form'!H121","v":0},{"$f":"'Order Form'!J121 & \"\"","v":""},{"$f":"'Order Form'!L121 & \"\"","v":""},{"$f":"'Order Form'!C121 & \"\"","v":""},{"$f":"'Order Form'!K121 & \"\"","v":""},{"$f":"'Order Form'!$E$14","v":"YES"},{"$f":"'Order Form'!$E$19","v":0},{"$f":"'Order Form'!$E$16","v":"FREE gift card"},{"$f":"'Order Form'!$E$17","v":"No thanks"},"No","No",{"$f":"\"Dispatch Week: \"&'Order Form'!$E$18","v":"Dispatch Week: "},{"$f":"\"VIP: \"&'Order Form'!$E$5 &\"; Rib: \"&'Order Form'!$E$17 &\"; GT: \"&'Order Form'!$E$16","v":"VIP: ; Rib: No thanks; GT: FREE gift card"},null,null,null,{"$f":"IF(P101=\"\",\"\",IFERROR(INDIRECT(\"Postcodes!$C\"&SUMPRODUCT(--(Postcodes!$A$2:$A$100<=P101)*(Postcodes!$B$2:$B$100>=P101), ROW(Postcodes!$A$2:$A$100))),\"WRONG CODE\"))","v":0},null,null,null,null,null,null,""]
[{"$f":"'Order Form'!A122","v":101},{"$f":"'Order Form'!M122","v":""},{"$f":"'Order Form'!$E$4","v":0},{"$f":"'Order Form'!$E$5","v":0},{"$f":"'Order Form'!$E$6","v":0},{"$f":"'Order Form'!$E$7","v":0},{"$f":"'Order Form'!$E$9","v":0},{"$f":"'Order Form'!$E$8","v":0},{"$f":"'Order Form'!$E$10","v":0},{"$f":"'Order Form'!$E$11","v":0},{"$f":"IF(('Order Form'!$E$15=\"YES\"),'Order Form'!$E$12,\"\")","v":0},{"$f":"'Order Form'!$E$13 & \"\"","v":""},{"$f":"IF('Order Form'!D122=\"\",'Order Form'!C122,'Order Form'!D122) & \"\"","v":""},{"$f":"'Order Form'!E122 & \"\"","v":""},{"$f":"'Order Form'!F122","v":0},{"$f":"'Order Form'!I122","v":0},{"$f":"'Order Form'!G122","v":0},{"$f":"'Order Form'!H122","v":0},{"$f":"'Order Form'!J122 & \"\"","v":""},{"$f":"'Order Form'!L122 & \"\"","v":""},{"$f":"'Order Form'!C122 & \"\"","v":""},{"$f":"'Order Form'!K122 & \"\"","v":""},{"$f":"'Order Form'!$E$14","v":"YES"},{"$f":"'Order Form'!$E$19","v":0},{"$f":"'Order Form'!$E$16","v":"FREE gift card"},{"$f":"'Order Form'!$E$17","v":"No thanks"},"No","No",{"$f":"\"Dispatch Week: \"&'Order Form'!$E$18","v":"Dispatch Week: "},{"$f":"\"VIP: \"&'Order Form'!$E$5 &\"; Rib: \"&'Order Form'!$E$17 &\"; GT: \"&'Order Form'!$E$16","v":"VIP: ; Rib: No thanks; GT: FREE gift card"},null,null,null,{"$f":"IF(P102=\"\",\"\",IFERROR(INDIRECT(\"Postcodes!$C\"&SUMPRODUCT(--(Postcodes!$A$2:$A$100<=P102)*(Postcodes!$B$2:$B$100>=P102), ROW(Postcodes!$A$2:$A$100))),\"WRONG CODE\"))","v":0},null,null,null,null,null,null,""]
[{"$f":"'Order Form'!A123","v":102},{"$f":"'Order Form'!M123","v":""},{"$f":"'Order Form'!$E$4","v":0},{"$f":"'Order Form'!$E$5","v":0},{"$f":"'Order Form'!$E$6","v":0},{"$f":"'Order Form'!$E$7","v":0},{"$f":"'Order Form'!$E$9","v":0},{"$f":"'Order Form'!$E$8","v":0},{"$f":"'Order Form'!$E$10","v":0},{"$f":"'Order Form'!$E$11","v":0},{"$f":"IF(('Order Form'!$E$15=\"YES\"),'Order Form'!$E$12,\"\")","v":0},{"$f":"'Order Form'!$E$13 & \"\"","v":""},{"$f":"IF('Order Form'!D123=\"\",'Order Form'!C123,'Order Form'!D123) & \"\"","v":""},{"$f":"'Order Form'!E123 & \"\"","v":""},{"$f":"'Order Form'!F123","v":0},{"$f":"'Order Form'!I123","v":0},{"$f":"'Order Form'!G123","v":0},{"$f":"'Order Form'!H123","v":0},{"$f":"'Order Form'!J123 & \"\"","v":""},{"$f":"'Order Form'!L123 & \"\"","v":""},{"$f":"'Order Form'!C123 & \"\"","v":""},{"$f":"'Order Form'!K123 & \"\"","v":""},{"$f":"'Order Form'!$E$14","v":"YES"},{"$f":"'Order Form'!$E$19","v":0},{"$f":"'Order Form'!$E$16","v":"FREE gift card"},{"$f":"'Order Form'!$E$17","v":"No thanks"},"No","No",{"$f":"\"Dispatch Week: \"&'Order Form'!$E$18","v":"Dispatch Week: "},{"$f":"\"VIP: \"&'Order Form'!$E$5 &\"; Rib: \"&'Order Form'!$E$17 &\"; GT: \"&'Order Form'!$E$16","v":"VIP: ; Rib: No thanks; GT: FREE gift card"},null,null,null,{"$f":"IF(P103=\"\",\"\",IFERROR(INDIRECT(\"Postcodes!$C\"&SUMPRODUCT(--(Postcodes!$A$2:$A$100<=P103)*(Postcodes!$B$2:$B$100>=P103), ROW(Postcodes!$A$2:$A$100))),\"WRONG CODE\"))","v":0},null,null,null,null,null,null,""]
[{"$f":"'Order Form'!A124","v":103},{"$f":"'Order Form'!M124","v":""},{"$f":"'Order Form'!$E$4","v":0},{"$f":"'Order Form'!$E$5","v":0},{"$f":"'Order Form'!$E$6","v":0},{"$f":"'Order Form'!$E$7","v":0},{"$f":"'Order Form'!$E$9","v":0},{"$f":"'Order Form'!$E$8","v":0},{"$f":"'Order Form'!$E$10","v":0},{"$f":"'Order Form'!$E$11","v":0},{"$f":"IF(('Order Form'!$E$15=\"YES\"),'Order Form'!$E$12,\"\")","v":0},{"$f":"'Order Form'!$E$13 & \"\"","v":""},{"$f":"IF('Order Form'!D124=\"\",'Order Form'!C124,'Order Form'!D124) & \"\"","v":""},{"$f":"'Order Form'!E124 & \"\"","v":""},{"$f":"'Order Form'!F124","v":0},{"$f":"'Order Form'!I124","v":0},{"$f":"'Order Form'!G124","v":0},{"$f":"'Order Form'!H124","v":0},{"$f":"'Order Form'!J124 & \"\"","v":""},{"$f":"'Order Form'!L124 & \"\"","v":""},{"$f":"'Order Form'!C124 & \"\"","v":""},{"$f":"'Order Form'!K124 & \"\"","v":""},{"$f":"'Order Form'!$E$14","v":"YES"},{"$f":"'Order Form'!$E$19","v":0},{"$f":"'Order Form'!$E$16","v":"FREE gift card"},{"$f":"'Order Form'!$E$17","v":"No thanks"},"No","No",{"$f":"\"Dispatch Week: \"&'Order Form'!$E$18","v":"Dispatch Week: "},{"$f":"\"VIP: \"&'Order Form'!$E$5 &\"; Rib: \"&'Order Form'!$E$17 &\"; GT: \"&'Order Form'!$E$16","v":"VIP: ; Rib: No thanks; GT: FREE gift card"},null,null,null,{"$f":"IF(P104=\"\",\"\",IFERROR(INDIRECT(\"Postcodes!$C\"&SUMPRODUCT(--(Postcodes!$A$2:$A$100<=P104)*(Postcodes!$B$2:$B$100>=P104), ROW(Postcodes!$A$2:$A$100))),\"WRONG CODE\"))","v":0},null,null,null,null,null,null,""]
[{"$f":"'Order Form'!A125","v":104},{"$f":"'Order Form'!M125","v":""},{"$f":"'Order Form'!$E$4","v":0},{"$f":"'Order Form'!$E$5","v":0},{"$f":"'Order Form'!$E$6","v":0},{"$f":"'Order Form'!$E$7","v":0},{"$f":"'Order Form'!$E$9","v":0},{"$f":"'Order Form'!$E$8","v":0},{"$f":"'Order Form'!$E$10","v":0},{"$f":"'Order Form'!$E$11","v":0},{"$f":"IF(('Order Form'!$E$15=\"YES\"),'Order Form'!$E$12,\"\")","v":0},{"$f":"'Order Form'!$E$13 & \"\"","v":""},{"$f":"IF('Order Form'!D125=\"\",'Order Form'!C125,'Order Form'!D125) & \"\"","v":""},{"$f":"'Order Form'!E125 & \"\"","v":""},{"$f":"'Order Form'!F125","v":0},{"$f":"'Order Form'!I125","v":0},{"$f":"'Order Form'!G125","v":0},{"$f":"'Order Form'!H125","v":0},{"$f":"'Order Form'!J125 & \"\"","v":""},{"$f":"'Order Form'!L125 & \"\"","v":""},{"$f":"'Order Form'!C125 & \"\"","v":""},{"$f":"'Order Form'!K125 & \"\"","v":""},{"$f":"'Order Form'!$E$14","v":"YES"},{"$f":"'Order Form'!$E$19","v":0},{"$f":"'Order Form'!$E$16","v":"FREE gift card"},{"$f":"'Order Form'!$E$17","v":"No thanks"},"No","No",{"$f":"\"Dispatch Week: \"&'Order Form'!$E$18","v":"Dispatch Week: "},{"$f":"\"VIP: \"&'Order Form'!$E$5 &\"; Rib: \"&'Order Form'!$E$17 &\"; GT: \"&'Order Form'!$E$16","v":"VIP: ; Rib: No thanks; GT: FREE gift card"},null,null,null,{"$f":"IF(P105=\"\",\"\",IFERROR(INDIRECT(\"Postcodes!$C\"&SUMPRODUCT(--(Postcodes!$A$2:$A$100<=P105)*(Postcodes!$B$2:$B$100>=P105), ROW(Postcodes!$A$2:$A$100))),\"WRONG CODE\"))","v":0},null,null,null,null,null,null,""]
[{"$f":"'Order Form'!A126","v":105},{"$f":"'Order Form'!M126","v":""},{"$f":"'Order Form'!$E$4","v":0},{"$f":"'Order Form'!$E$5","v":0},{"$f":"'Order Form'!$E$6","v":0},{"$f":"'Order Form'!$E$7","v":0},{"$f":"'Order Form'!$E$9","v":0},{"$f":"'Order Form'!$E$8","v":0},{"$f":"'Order Form'!$E$10","v":0},{"$f":"'Order Form'!$E$11","v":0},{"$f":"IF(('Order Form'!$E$15=\"YES\"),'Order Form'!$E$12,\"\")","v":0},{"$f":"'Order Form'!$E$13 & \"\"","v":""},{"$f":"IF('Order Form'!D126=\"\",'Order Form'!C126,'Order Form'!D126) & \"\"","v":""},{"$f":"'Order Form'!E126 & \"\"","v":""},{"$f":"'Order Form'!F126","v":0},{"$f":"'Order Form'!I126","v":0},{"$f":"'Order Form'!G126","v":0},{"$f":"'Order Form'!H126","v":0},{"$f":"'Order Form'!J126 & \"\"","v":""},{"$f":"'Order Form'!L126 & \"\"","v":""},{"$f":"'Order Form'!C126 & \"\"","v":""},{"$f":"'Order Form'!K126 & \"\"","v":""},{"$f":"'Order Form'!$E$14","v":"YES"},{"$f":"'Order Form'!$E$19","v":0},{"$f":"'Order Form'!$E$16","v":"FREE gift card"},{"$f":"'Order Form'!$E$17","v":"No thanks"},"No","No",{"$f":"\"Dispatch Week: \"&'Order Form'!$E$18","v":"Dispatch Week: "},{"$f":"\"VIP: \"&'Order Form'!$E$5 &\"; Rib: \"&'Order Form'!$E$17 &\"; GT: \"&'Order Form'!$E$16","v":"VIP: ; Rib: No thanks; GT: FREE gift card"},null,null,null,{"$f":"IF(P106=\"\",\"\",IFERROR(INDIRECT(\"Postcodes!$C\"&SUMPRODUCT(--(Postcodes!$A$2:$A$100<=P106)*(Postcodes!$B$2:$B$100>=P106), ROW(Postcodes!$A$2:$A$100))),\"WRONG CODE\"))","v":0},null,null,null,null,null,null,""]
[{"$f":"'Order Form'!A127","v":106},{"$f":"'Order Form'!M127","v":""},{"$f":"'Order Form'!$E$4","v":0},{"$f":"'Order Form'!$E$5","v":0},{"$f":"'Order Form'!$E$6","v":0},{"$f":"'Order Form'!$E$7","v":0},{"$f":"'Order Form'!$E$9","v":0},{"$f":"'Order Form'!$E$8","v":0},{"$f":"'Order Form'!$E$10","v":0},{"$f":"'Order Form'!$E$11","v":0},{"$f":"IF(('Order Form'!$E$15=\"YES\"),'Order Form'!$E$12,\"\")","v":0},{"$f":"'Order Form'!$E$13 & \"\"","v":""},{"$f":"IF('Order Form'!D127=\"\",'Order Form'!C127,'Order Form'!D127) & \"\"","v":""},{"$f":"'Order Form'!E127 & \"\"","v":""},{"$f":"'Order Form'!F127","v":0},{"$f":"'Order Form'!I127","v":0},{"$f":"'Order Form'!G127","v":0},{"$f":"'Order Form'!H127","v":0},{"$f":"'Order Form'!J127 & \"\"","v":""},{"$f":"'Order Form'!L127 & \"\"","v":""},{"$f":"'Order Form'!C127 & \"\"","v":""},{"$f":"'Order Form'!K127 & \"\"","v":""},{"$f":"'Order Form'!$E$14","v":"YES"},{"$f":"'Order Form'!$E$19","v":0},{"$f":"'Order Form'!$E$16","v":"FREE gift card"},{"$f":"'Order Form'!$E$17","v":"No thanks"},"No","No",{"$f":"\"Dispatch Week: \"&'Order Form'!$E$18","v":"Dispatch Week: "},{"$f":"\"VIP: \"&'Order Form'!$E$5 &\"; Rib: \"&'Order Form'!$E$17 &\"; GT: \"&'Order Form'!$E$16","v":"VIP: ; Rib: No thanks; GT: FREE gift card"},null,null,null,{"$f":"IF(P107=\"\",\"\",IFERROR(INDIRECT(\"Postcodes!$C\"&SUMPRODUCT(--(Postcodes!$A$2:$A$100<=P107)*(Postcodes!$B$2:$B$100>=P107), ROW(Postcodes!$A$2:$A$100))),\"WRONG CODE\"))","v":0},null,null,null,null,null,null,""]
[{"$f":"'Order Form'!A128","v":107},{"$f":"'Order Form'!M128","v":""},{"$f":"'Order Form'!$E$4","v":0},{"$f":"'Order Form'!$E$5","v":0},{"$f":"'Order Form'!$E$6","v":0},{"$f":"'Order Form'!$E$7","v":0},{"$f":"'Order Form'!$E$9","v":0},{"$f":"'Order Form'!$E$8","v":0},{"$f":"'Order Form'!$E$10","v":0},{"$f":"'Order Form'!$E$11","v":0},{"$f":"IF(('Order Form'!$E$15=\"YES\"),'Order Form'!$E$12,\"\")","v":0},{"$f":"'Order Form'!$E$13 & \"\"","v":""},{"$f":"IF('Order Form'!D128=\"\",'Order Form'!C128,'Order Form'!D128) & \"\"","v":""},{"$f":"'Order Form'!E128 & \"\"","v":""},{"$f":"'Order Form'!F128","v":0},{"$f":"'Order Form'!I128","v":0},{"$f":"'Order Form'!G128","v":0},{"$f":"'Order Form'!H128","v":0},{"$f":"'Order Form'!J128 & \"\"","v":""},{"$f":"'Order Form'!L128 & \"\"","v":""},{"$f":"'Order Form'!C128 & \"\"","v":""},{"$f":"'Order Form'!K128 & \"\"","v":""},{"$f":"'Order Form'!$E$14","v":"YES"},{"$f":"'Order Form'!$E$19","v":0},{"$f":"'Order Form'!$E$16","v":"FREE gift card"},{"$f":"'Order Form'!$E$17","v":"No thanks"},"No","No",{"$f":"\"Dispatch Week: \"&'Order Form'!$E$18","v":"Dispatch Week: "},{"$f":"\"VIP: \"&'Order Form'!$E$5 &\"; Rib: \"&'Order Form'!$E$17 &\"; GT: \"&'Order Form'!$E$16","v":"VIP: ; Rib: No thanks; GT: FREE gift card"},null,null,null,{"$f":"IF(P108=\"\",\"\",IFERROR(INDIRECT(\"Postcodes!$C\"&SUMPRODUCT(--(Postcodes!$A$2:$A$100<=P108)*(Postcodes!$B$2:$B$100>=P108), ROW(Postcodes!$A$2:$A$100))),\"WRONG CODE\"))","v":0},null,null,null,null,null,null,""]
[{"$f":"'Order Form'!A129","v":108},{"$f":"'Order Form'!M129","v":""},{"$f":"'Order Form'!$E$4","v":0},{"$f":"'Order Form'!$E$5","v":0},{"$f":"'Order Form'!$E$6","v":0},{"$f":"'Order Form'!$E$7","v":0},{"$f":"'Order Form'!$E$9","v":0},{"$f":"'Order Form'!$E$8","v":0},{"$f":"'Order Form'!$E$10","v":0},{"$f":"'Order Form'!$E$11","v":0},{"$f":"IF(('Order Form'!$E$15=\"YES\"),'Order Form'!$E$12,\"\")","v":0},{"$f":"'Order Form'!$E$13 & \"\"","v":""},{"$f":"IF('Order Form'!D129=\"\",'Order Form'!C129,'Order Form'!D129) & \"\"","v":""},{"$f":"'Order Form'!E129 & \"\"","v":""},{"$f":"'Order Form'!F129","v":0},{"$f":"'Order Form'!I129","v":0},{"$f":"'Order Form'!G129","v":0},{"$f":"'Order Form'!H129","v":0},{"$f":"'Order Form'!J129 & \"\"","v":""},{"$f":"'Order Form'!L129 & \"\"","v":""},{"$f":"'Order Form'!C129 & \"\"","v":""},{"$f":"'Order Form'!K129 & \"\"","v":""},{"$f":"'Order Form'!$E$14","v":"YES"},{"$f":"'Order Form'!$E$19","v":0},{"$f":"'Order Form'!$E$16","v":"FREE gift card"},{"$f":"'Order Form'!$E$17","v":"No thanks"},"No","No",{"$f":"\"Dispatch Week: \"&'Order Form'!$E$18","v":"Dispatch Week: "},{"$f":"\"VIP: \"&'Order Form'!$E$5 &\"; Rib: \"&'Order Form'!$E$17 &\"; GT: \"&'Order Form'!$E$16","v":"VIP: ; Rib: No thanks; GT: FREE gift card"},null,null,null,{"$f":"IF(P109=\"\",\"\",IFERROR(INDIRECT(\"Postcodes!$C\"&SUMPRODUCT(--(Postcodes!$A$2:$A$100<=P109)*(Postcodes!$B$2:$B$100>=P109), ROW(Postcodes!$A$2:$A$100))),\"WRONG CODE\"))","v":0},null,null,null,null,null,null,""]
[{"$f":"'Order Form'!A130","v":109},{"$f":"'Order Form'!M130","v":""},{"$f":"'Order Form'!$E$4","v":0},{"$f":"'Order Form'!$E$5","v":0},{"$f":"'Order Form'!$E$6","v":0},{"$f":"'Order Form'!$E$7","v":0},{"$f":"'Order Form'!$E$9","v":0},{"$f":"'Order Form'!$E$8","v":0},{"$f":"'Order Form'!$E$10","v":0},{"$f":"'Order Form'!$E$11","v":0},{"$f":"IF(('Order Form'!$E$15=\"YES\"),'Order Form'!$E$12,\"\")","v":0},{"$f":"'Order Form'!$E$13 & \"\"","v":""},{"$f":"IF('Order Form'!D130=\"\",'Order Form'!C130,'Order Form'!D130) & \"\"","v":""},{"$f":"'Order Form'!E130 & \"\"","v":""},{"$f":"'Order Form'!F130","v":0},{"$f":"'Order Form'!I130","v":0},{"$f":"'Order Form'!G130","v":0},{"$f":"'Order Form'!H130","v":0},{"$f":"'Order Form'!J130 & \"\"","v":""},{"$f":"'Order Form'!L130 & \"\"","v":""},{"$f":"'Order Form'!C130 & \"\"","v":""},{"$f":"'Order Form'!K130 & \"\"","v":""},{"$f":"'Order Form'!$E$14","v":"YES"},{"$f":"'Order Form'!$E$19","v":0},{"$f":"'Order Form'!$E$16","v":"FREE gift card"},{"$f":"'Order Form'!$E$17","v":"No thanks"},"No","No",{"$f":"\"Dispatch Week: \"&'Order Form'!$E$18","v":"Dispatch Week: "},{"$f":"\"VIP: \"&'Order Form'!$E$5 &\"; Rib: \"&'Order Form'!$E$17 &\"; GT: \"&'Order Form'!$E$16","v":"VIP: ; Rib: No thanks; GT: FREE gift card"},null,null,null,{"$f":"IF(P110=\"\",\"\",IFERROR(INDIRECT(\"Postcodes!$C\"&SUMPRODUCT(--(Postcodes!$A$2:$A$100<=P110)*(Postcodes!$B$2:$B$100>=P110), ROW(Postcodes!$A$2:$A$100))),\"WRONG CODE\"))","v":0},null,null,null,null,null,null,""]
[{"$f":"'Order Form'!A131","v":110},{"$f":"'Order Form'!M131","v":""},{"$f":"'Order Form'!$E$4","v":0},{"$f":"'Order Form'!$E$5","v":0},{"$f":"'Order Form'!$E$6","v":0},{"$f":"'Order Form'!$E$7","v":0},{"$f":"'Order Form'!$E$9","v":0},{"$f":"'Order Form'!$E$8","v":0},{"$f":"'Order Form'!$E$10","v":0},{"$f":"'Order Form'!$E$11","v":0},{"$f":"IF(('Order Form'!$E$15=\"YES\"),'Order Form'!$E$12,\"\")","v":0},{"$f":"'Order Form'!$E$13 & \"\"","v":""},{"$f":"IF('Order Form'!D131=\"\",'Order Form'!C131,'Order Form'!D131) & \"\"","v":""},{"$f":"'Order Form'!E131 & \"\"","v":""},{"$f":"'Order Form'!F131","v":0},{"$f":"'Order Form'!I131","v":0},{"$f":"'Order Form'!G131","v":0},{"$f":"'Order Form'!H131","v":0},{"$f":"'Order Form'!J131 & \"\"","v":""},{"$f":"'Order Form'!L131 & \"\"","v":""},{"$f":"'Order Form'!C131 & \"\"","v":""},{"$f":"'Order Form'!K131 & \"\"","v":""},{"$f":"'Order Form'!$E$14","v":"YES"},{"$f":"'Order Form'!$E$19","v":0},{"$f":"'Order Form'!$E$16","v":"FREE gift card"},{"$f":"'Order Form'!$E$17","v":"No thanks"},"No","No",{"$f":"\"Dispatch Week: \"&'Order Form'!$E$18","v":"Dispatch Week: "},{"$f":"\"VIP: \"&'Order Form'!$E$5 &\"; Rib: \"&'Order Form'!$E$17 &\"; GT: \"&'Order Form'!$E$16","v":"VIP: ; Rib: No thanks; GT: FREE gift card"},null,null,null,{"$f":"IF(P111=\"\",\"\",IFERROR(INDIRECT(\"Postcodes!$C\"&SUMPRODUCT(--(Postcodes!$A$2:$A$100<=P111)*(Postcodes!$B$2:$B$100>=P111), ROW(Postcodes!$A$2:$A$100))),\"WRONG CODE\"))","v":0},null,null,null,null,null,null,""]
[{"$f":"'Order Form'!A132","v":111},{"$f":"'Order Form'!M132","v":""},{"$f":"'Order Form'!$E$4","v":0},{"$f":"'Order Form'!$E$5","v":0},{"$f":"'Order Form'!$E$6","v":0},{"$f":"'Order Form'!$E$7","v":0},{"$f":"'Order Form'!$E$9","v":0},{"$f":"'Order Form'!$E$8","v":0},{"$f":"'Order Form'!$E$10","v":0},{"$f":"'Order Form'!$E$11","v":0},{"$f":"IF(('Order Form'!$E$15=\"YES\"),'Order Form'!$E$12,\"\")","v":0},{"$f":"'Order Form'!$E$13 & \"\"","v":""},{"$f":"IF('Order Form'!D132=\"\",'Order Form'!C132,'Order Form'!D132) & \"\"","v":""},{"$f":"'Order Form'!E132 & \"\"","v":""},{"$f":"'Order Form'!F132","v":0},{"$f":"'Order Form'!I132","v":0},{"$f":"'Order Form'!G132","v":0},{"$f":"'Order Form'!H132","v":0},{"$f":"'Order Form'!J132 & \"\"","v":""},{"$f":"'Order Form'!L132 & \"\"","v":""},{"$f":"'Order Form'!C132 & \"\"","v":""},{"$f":"'Order Form'!K132 & \"\"","v":""},{"$f":"'Order Form'!$E$14","v":"YES"},{"$f":"'Order Form'!$E$19","v":0},{"$f":"'Order Form'!$E$16","v":"FREE gift card"},{"$f":"'Order Form'!$E$17","v":"No thanks"},"No","No",{"$f":"\"Dispatch Week: \"&'Order Form'!$E$18","v":"Dispatch Week: "},{"$f":"\"VIP: \"&'Order Form'!$E$5 &\"; Rib: \"&'Order Form'!$E$17 &\"; GT: \"&'Order Form'!$E$16","v":"VIP: ; Rib: No thanks; GT: FREE gift card"},null,null,null,{"$f":"IF(P112=\"\",\"\",IFERROR(INDIRECT(\"Postcodes!$C\"&SUMPRODUCT(--(Postcodes!$A$2:$A$100<=P112)*(Postcodes!$B$2:$B$100>=P112), ROW(Postcodes!$A$2:$A$100))),\"WRONG CODE\"))","v":0},null,null,null,null,null,null,""]
[{"$f":"'Order Form'!A133","v":112},{"$f":"'Order Form'!M133","v":""},{"$f":"'Order Form'!$E$4","v":0},{"$f":"'Order Form'!$E$5","v":0},{"$f":"'Order Form'!$E$6","v":0},{"$f":"'Order Form'!$E$7","v":0},{"$f":"'Order Form'!$E$9","v":0},{"$f":"'Order Form'!$E$8","v":0},{"$f":"'Order Form'!$E$10","v":0},{"$f":"'Order Form'!$E$11","v":0},{"$f":"IF(('Order Form'!$E$15=\"YES\"),'Order Form'!$E$12,\"\")","v":0},{"$f":"'Order Form'!$E$13 & \"\"","v":""},{"$f":"IF('Order Form'!D133=\"\",'Order Form'!C133,'Order Form'!D133) & \"\"","v":""},{"$f":"'Order Form'!E133 & \"\"","v":""},{"$f":"'Order Form'!F133","v":0},{"$f":"'Order Form'!I133","v":0},{"$f":"'Order Form'!G133","v":0},{"$f":"'Order Form'!H133","v":0},{"$f":"'Order Form'!J133 & \"\"","v":""},{"$f":"'Order Form'!L133 & \"\"","v":""},{"$f":"'Order Form'!C133 & \"\"","v":""},{"$f":"'Order Form'!K133 & \"\"","v":""},{"$f":"'Order Form'!$E$14","v":"YES"},{"$f":"'Order Form'!$E$19","v":0},{"$f":"'Order Form'!$E$16","v":"FREE gift card"},{"$f":"'Order Form'!$E$17","v":"No thanks"},"No","No",{"$f":"\"Dispatch Week: \"&'Order Form'!$E$18","v":"Dispatch Week: "},{"$f":"\"VIP: \"&'Order Form'!$E$5 &\"; Rib: \"&'Order Form'!$E$17 &\"; GT: \"&'Order Form'!$E$16","v":"VIP: ; Rib: No thanks; GT: FREE gift card"},null,null,null,{"$f":"IF(P113=\"\",\"\",IFERROR(INDIRECT(\"Postcodes!$C\"&SUMPRODUCT(--(Postcodes!$A$2:$A$100<=P113)*(Postcodes!$B$2:$B$100>=P113), ROW(Postcodes!$A$2:$A$100))),\"WRONG CODE\"))","v":0},null,null,null,null,null,null,""]
[{"$f":"'Order Form'!A134","v":113},{"$f":"'Order Form'!M134","v":""},{"$f":"'Order Form'!$E$4","v":0},{"$f":"'Order Form'!$E$5","v":0},{"$f":"'Order Form'!$E$6","v":0},{"$f":"'Order Form'!$E$7","v":0},{"$f":"'Order Form'!$E$9","v":0},{"$f":"'Order Form'!$E$8","v":0},{"$f":"'Order Form'!$E$10","v":0},{"$f":"'Order Form'!$E$11","v":0},{"$f":"IF(('Order Form'!$E$15=\"YES\"),'Order Form'!$E$12,\"\")","v":0},{"$f":"'Order Form'!$E$13 & \"\"","v":""},{"$f":"IF('Order Form'!D134=\"\",'Order Form'!C134,'Order Form'!D134) & \"\"","v":""},{"$f":"'Order Form'!E134 & \"\"","v":""},{"$f":"'Order Form'!F134","v":0},{"$f":"'Order Form'!I134","v":0},{"$f":"'Order Form'!G134","v":0},{"$f":"'Order Form'!H134","v":0},{"$f":"'Order Form'!J134 & \"\"","v":""},{"$f":"'Order Form'!L134 & \"\"","v":""},{"$f":"'Order Form'!C134 & \"\"","v":""},{"$f":"'Order Form'!K134 & \"\"","v":""},{"$f":"'Order Form'!$E$14","v":"YES"},{"$f":"'Order Form'!$E$19","v":0},{"$f":"'Order Form'!$E$16","v":"FREE gift card"},{"$f":"'Order Form'!$E$17","v":"No thanks"},"No","No",{"$f":"\"Dispatch Week: \"&'Order Form'!$E$18","v":"Dispatch Week: "},{"$f":"\"VIP: \"&'Order Form'!$E$5 &\"; Rib: \"&'Order Form'!$E$17 &\"; GT: \"&'Order Form'!$E$16","v":"VIP: ; Rib: No thanks; GT: FREE gift card"},null,null,null,{"$f":"IF(P114=\"\",\"\",IFERROR(INDIRECT(\"Postcodes!$C\"&SUMPRODUCT(--(Postcodes!$A$2:$A$100<=P114)*(Postcodes!$B$2:$B$100>=P114), ROW(Postcodes!$A$2:$A$100))),\"WRONG CODE\"))","v":0},null,null,null,null,null,null,""]
[{"$f":"'Order Form'!A135","v":114},{"$f":"'Order Form'!M135","v":""},{"$f":"'Order Form'!$E$4","v":0},{"$f":"'Order Form'!$E$5","v":0},{"$f":"'Order Form'!$E$6","v":0},{"$f":"'Order Form'!$E$7","v":0},{"$f":"'Order Form'!$E$9","v":0},{"$f":"'Order Form'!$E$8","v":0},{"$f":"'Order Form'!$E$10","v":0},{"$f":"'Order Form'!$E$11","v":0},{"$f":"IF(('Order Form'!$E$15=\"YES\"),'Order Form'!$E$12,\"\")","v":0},{"$f":"'Order Form'!$E$13 & \"\"","v":""},{"$f":"IF('Order Form'!D135=\"\",'Order Form'!C135,'Order Form'!D135) & \"\"","v":""},{"$f":"'Order Form'!E135 & \"\"","v":""},{"$f":"'Order Form'!F135","v":0},{"$f":"'Order Form'!I135","v":0},{"$f":"'Order Form'!G135","v":0},{"$f":"'Order Form'!H135","v":0},{"$f":"'Order Form'!J135 & \"\"","v":""},{"$f":"'Order Form'!L135 & \"\"","v":""},{"$f":"'Order Form'!C135 & \"\"","v":""},{"$f":"'Order Form'!K135 & \"\"","v":""},{"$f":"'Order Form'!$E$14","v":"YES"},{"$f":"'Order Form'!$E$19","v":0},{"$f":"'Order Form'!$E$16","v":"FREE gift card"},{"$f":"'Order Form'!$E$17","v":"No thanks"},"No","No",{"$f":"\"Dispatch Week: \"&'Order Form'!$E$18","v":"Dispatch Week: "},{"$f":"\"VIP: \"&'Order Form'!$E$5 &\"; Rib: \"&'Order Form'!$E$17 &\"; GT: \"&'Order Form'!$E$16","v":"VIP: ; Rib: No thanks; GT: FREE gift card"},null,null,null,{"$f":"IF(P115=\"\",\"\",IFERROR(INDIRECT(\"Postcodes!$C\"&SUMPRODUCT(--(Postcodes!$A$2:$A$100<=P115)*(Postcodes!$B$2:$B$100>=P115), ROW(Postcodes!$A$2:$A$100))),\"WRONG CODE\"))","v":0},null,null,null,null,null,null,""]
[{"$f":"'Order Form'!A136","v":115},{"$f":"'Order Form'!M136","v":""},{"$f":"'Order Form'!$E$4","v":0},{"$f":"'Order Form'!$E$5","v":0},{"$f":"'Order Form'!$E$6","v":0},{"$f":"'Order Form'!$E$7","v":0},{"$f":"'Order Form'!$E$9","v":0},{"$f":"'Order Form'!$E$8","v":0},{"$f":"'Order Form'!$E$10","v":0},{"$f":"'Order Form'!$E$11","v":0},{"$f":"IF(('Order Form'!$E$15=\"YES\"),'Order Form'!$E$12,\"\")","v":0},{"$f":"'Order Form'!$E$13 & \"\"","v":""},{"$f":"IF('Order Form'!D136=\"\",'Order Form'!C136,'Order Form'!D136) & \"\"","v":""},{"$f":"'Order Form'!E136 & \"\"","v":""},{"$f":"'Order Form'!F136","v":0},{"$f":"'Order Form'!I136","v":0},{"$f":"'Order Form'!G136","v":0},{"$f":"'Order Form'!H136","v":0},{"$f":"'Order Form'!J136 & \"\"","v":""},{"$f":"'Order Form'!L136 & \"\"","v":""},{"$f":"'Order Form'!C136 & \"\"","v":""},{"$f":"'Order Form'!K136 & \"\"","v":""},{"$f":"'Order Form'!$E$14","v":"YES"},{"$f":"'Order Form'!$E$19","v":0},{"$f":"'Order Form'!$E$16","v":"FREE gift card"},{"$f":"'Order Form'!$E$17","v":"No thanks"},"No","No",{"$f":"\"Dispatch Week: \"&'Order Form'!$E$18","v":"Dispatch Week: "},{"$f":"\"VIP: \"&'Order Form'!$E$5 &\"; Rib: \"&'Order Form'!$E$17 &\"; GT: \"&'Order Form'!$E$16","v":"VIP: ; Rib: No thanks; GT: FREE gift card"},null,null,null,{"$f":"IF(P116=\"\",\"\",IFERROR(INDIRECT(\"Postcodes!$C\"&SUMPRODUCT(--(Postcodes!$A$2:$A$100<=P116)*(Postcodes!$B$2:$B$100>=P116), ROW(Postcodes!$A$2:$A$100))),\"WRONG CODE\"))","v":0},null,null,null,null,null,null,""]
[{"$f":"'Order Form'!A137","v":116},{"$f":"'Order Form'!M137","v":""},{"$f":"'Order Form'!$E$4","v":0},{"$f":"'Order Form'!$E$5","v":0},{"$f":"'Order Form'!$E$6","v":0},{"$f":"'Order Form'!$E$7","v":0},{"$f":"'Order Form'!$E$9","v":0},{"$f":"'Order Form'!$E$8","v":0},{"$f":"'Order Form'!$E$10","v":0},{"$f":"'Order Form'!$E$11","v":0},{"$f":"IF(('Order Form'!$E$15=\"YES\"),'Order Form'!$E$12,\"\")","v":0},{"$f":"'Order Form'!$E$13 & \"\"","v":""},{"$f":"IF('Order Form'!D137=\"\",'Order Form'!C137,'Order Form'!D137) & \"\"","v":""},{"$f":"'Order Form'!E137 & \"\"","v":""},{"$f":"'Order Form'!F137","v":0},{"$f":"'Order Form'!I137","v":0},{"$f":"'Order Form'!G137","v":0},{"$f":"'Order Form'!H137","v":0},{"$f":"'Order Form'!J137 & \"\"","v":""},{"$f":"'Order Form'!L137 & \"\"","v":""},{"$f":"'Order Form'!C137 & \"\"","v":""},{"$f":"'Order Form'!K137 & \"\"","v":""},{"$f":"'Order Form'!$E$14","v":"YES"},{"$f":"'Order Form'!$E$19","v":0},{"$f":"'Order Form'!$E$16","v":"FREE gift card"},{"$f":"'Order Form'!$E$17","v":"No thanks"},"No","No",{"$f":"\"Dispatch Week: \"&'Order Form'!$E$18","v":"Dispatch Week: "},{"$f":"\"VIP: \"&'Order Form'!$E$5 &\"; Rib: \"&'Order Form'!$E$17 &\"; GT: \"&'Order Form'!$E$16","v":"VIP: ; Rib: No thanks; GT: FREE gift card"},null,null,null,{"$f":"IF(P117=\"\",\"\",IFERROR(INDIRECT(\"Postcodes!$C\"&SUMPRODUCT(--(Postcodes!$A$2:$A$100<=P117)*(Postcodes!$B$2:$B$100>=P117), ROW(Postcodes!$A$2:$A$100))),\"WRONG CODE\"))","v":0},null,null,null,null,null,null,""]
[{"$f":"'Order Form'!A138","v":117},{"$f":"'Order Form'!M138","v":""},{"$f":"'Order Form'!$E$4","v":0},{"$f":"'Order Form'!$E$5","v":0},{"$f":"'Order Form'!$E$6","v":0},{"$f":"'Order Form'!$E$7","v":0},{"$f":"'Order Form'!$E$9","v":0},{"$f":"'Order Form'!$E$8","v":0},{"$f":"'Order Form'!$E$10","v":0},{"$f":"'Order Form'!$E$11","v":0},{"$f":"IF(('Order Form'!$E$15=\"YES\"),'Order Form'!$E$12,\"\")","v":0},{"$f":"'Order Form'!$E$13 & \"\"","v":""},{"$f":"IF('Order Form'!D138=\"\",'Order Form'!C138,'Order Form'!D138) & \"\"","v":""},{"$f":"'Order Form'!E138 & \"\"","v":""},{"$f":"'Order Form'!F138","v":0},{"$f":"'Order Form'!I138","v":0},{"$f":"'Order Form'!G138","v":0},{"$f":"'Order Form'!H138","v":0},{"$f":"'Order Form'!J138 & \"\"","v":""},{"$f":"'Order Form'!L138 & \"\"","v":""},{"$f":"'Order Form'!C138 & \"\"","v":""},{"$f":"'Order Form'!K138 & \"\"","v":""},{"$f":"'Order Form'!$E$14","v":"YES"},{"$f":"'Order Form'!$E$19","v":0},{"$f":"'Order Form'!$E$16","v":"FREE gift card"},{"$f":"'Order Form'!$E$17","v":"No thanks"},"No","No",{"$f":"\"Dispatch Week: \"&'Order Form'!$E$18","v":"Dispatch Week: "},{"$f":"\"VIP: \"&'Order Form'!$E$5 &\"; Rib: \"&'Order Form'!$E$17 &\"; GT: \"&'Order Form'!$E$16","v":"VIP: ; Rib: No thanks; GT: FREE gift card"},null,null,null,{"$f":"IF(P118=\"\",\"\",IFERROR(INDIRECT(\"Postcodes!$C\"&SUMPRODUCT(--(Postcodes!$A$2:$A$100<=P118)*(Postcodes!$B$2:$B$100>=P118), ROW(Postcodes!$A$2:$A$100))),\"WRONG CODE\"))","v":0},null,null,null,null,null,null,""]
[{"$f":"'Order Form'!A139","v":118},{"$f":"'Order Form'!M139","v":""},{"$f":"'Order Form'!$E$4","v":0},{"$f":"'Order Form'!$E$5","v":0},{"$f":"'Order Form'!$E$6","v":0},{"$f":"'Order Form'!$E$7","v":0},{"$f":"'Order Form'!$E$9","v":0},{"$f":"'Order Form'!$E$8","v":0},{"$f":"'Order Form'!$E$10","v":0},{"$f":"'Order Form'!$E$11","v":0},{"$f":"IF(('Order Form'!$E$15=\"YES\"),'Order Form'!$E$12,\"\")","v":0},{"$f":"'Order Form'!$E$13 & \"\"","v":""},{"$f":"IF('Order Form'!D139=\"\",'Order Form'!C139,'Order Form'!D139) & \"\"","v":""},{"$f":"'Order Form'!E139 & \"\"","v":""},{"$f":"'Order Form'!F139","v":0},{"$f":"'Order Form'!I139","v":0},{"$f":"'Order Form'!G139","v":0},{"$f":"'Order Form'!H139","v":0},{"$f":"'Order Form'!J139 & \"\"","v":""},{"$f":"'Order Form'!L139 & \"\"","v":""},{"$f":"'Order Form'!C139 & \"\"","v":""},{"$f":"'Order Form'!K139 & \"\"","v":""},{"$f":"'Order Form'!$E$14","v":"YES"},{"$f":"'Order Form'!$E$19","v":0},{"$f":"'Order Form'!$E$16","v":"FREE gift card"},{"$f":"'Order Form'!$E$17","v":"No thanks"},"No","No",{"$f":"\"Dispatch Week: \"&'Order Form'!$E$18","v":"Dispatch Week: "},{"$f":"\"VIP: \"&'Order Form'!$E$5 &\"; Rib: \"&'Order Form'!$E$17 &\"; GT: \"&'Order Form'!$E$16","v":"VIP: ; Rib: No thanks; GT: FREE gift card"},null,null,null,{"$f":"IF(P119=\"\",\"\",IFERROR(INDIRECT(\"Postcodes!$C\"&SUMPRODUCT(--(Postcodes!$A$2:$A$100<=P119)*(Postcodes!$B$2:$B$100>=P119), ROW(Postcodes!$A$2:$A$100))),\"WRONG CODE\"))","v":0},null,null,null,null,null,null,""]
[{"$f":"'Order Form'!A140","v":119},{"$f":"'Order Form'!M140","v":""},{"$f":"'Order Form'!$E$4","v":0},{"$f":"'Order Form'!$E$5","v":0},{"$f":"'Order Form'!$E$6","v":0},{"$f":"'Order Form'!$E$7","v":0},{"$f":"'Order Form'!$E$9","v":0},{"$f":"'Order Form'!$E$8","v":0},{"$f":"'Order Form'!$E$10","v":0},{"$f":"'Order Form'!$E$11","v":0},{"$f":"IF(('Order Form'!$E$15=\"YES\"),'Order Form'!$E$12,\"\")","v":0},{"$f":"'Order Form'!$E$13 & \"\"","v":""},{"$f":"IF('Order Form'!D140=\"\",'Order Form'!C140,'Order Form'!D140) & \"\"","v":""},{"$f":"'Order Form'!E140 & \"\"","v":""},{"$f":"'Order Form'!F140","v":0},{"$f":"'Order Form'!I140","v":0},{"$f":"'Order Form'!G140","v":0},{"$f":"'Order Form'!H140","v":0},{"$f":"'Order Form'!J140 & \"\"","v":""},{"$f":"'Order Form'!L140 & \"\"","v":""},{"$f":"'Order Form'!C140 & \"\"","v":""},{"$f":"'Order Form'!K140 & \"\"","v":""},{"$f":"'Order Form'!$E$14","v":"YES"},{"$f":"'Order Form'!$E$19","v":0},{"$f":"'Order Form'!$E$16","v":"FREE gift card"},{"$f":"'Order Form'!$E$17","v":"No thanks"},"No","No",{"$f":"\"Dispatch Week: \"&'Order Form'!$E$18","v":"Dispatch Week: "},{"$f":"\"VIP: \"&'Order Form'!$E$5 &\"; Rib: \"&'Order Form'!$E$17 &\"; GT: \"&'Order Form'!$E$16","v":"VIP: ; Rib: No thanks; GT: FREE gift card"},null,null,null,{"$f":"IF(P120=\"\",\"\",IFERROR(INDIRECT(\"Postcodes!$C\"&SUMPRODUCT(--(Postcodes!$A$2:$A$100<=P120)*(Postcodes!$B$2:$B$100>=P120), ROW(Postcodes!$A$2:$A$100))),\"WRONG CODE\"))","v":0},null,null,null,null,null,null,""]
[{"$f":"'Order Form'!A141","v":120},{"$f":"'Order Form'!M141","v":""},{"$f":"'Order Form'!$E$4","v":0},{"$f":"'Order Form'!$E$5","v":0},{"$f":"'Order Form'!$E$6","v":0},{"$f":"'Order Form'!$E$7","v":0},{"$f":"'Order Form'!$E$9","v":0},{"$f":"'Order Form'!$E$8","v":0},{"$f":"'Order Form'!$E$10","v":0},{"$f":"'Order Form'!$E$11","v":0},{"$f":"IF(('Order Form'!$E$15=\"YES\"),'Order Form'!$E$12,\"\")","v":0},{"$f":"'Order Form'!$E$13 & \"\"","v":""},{"$f":"IF('Order Form'!D141=\"\",'Order Form'!C141,'Order Form'!D141) & \"\"","v":""},{"$f":"'Order Form'!E141 & \"\"","v":""},{"$f":"'Order Form'!F141","v":0},{"$f":"'Order Form'!I141","v":0},{"$f":"'Order Form'!G141","v":0},{"$f":"'Order Form'!H141","v":0},{"$f":"'Order Form'!J141 & \"\"","v":""},{"$f":"'Order Form'!L141 & \"\"","v":""},{"$f":"'Order Form'!C141 & \"\"","v":""},{"$f":"'Order Form'!K141 & \"\"","v":""},{"$f":"'Order Form'!$E$14","v":"YES"},{"$f":"'Order Form'!$E$19","v":0},{"$f":"'Order Form'!$E$16","v":"FREE gift card"},{"$f":"'Order Form'!$E$17","v":"No thanks"},"No","No",{"$f":"\"Dispatch Week: \"&'Order Form'!$E$18","v":"Dispatch Week: "},{"$f":"\"VIP: \"&'Order Form'!$E$5 &\"; Rib: \"&'Order Form'!$E$17 &\"; GT: \"&'Order Form'!$E$16","v":"VIP: ; Rib: No thanks; GT: FREE gift card"},null,null,null,{"$f":"IF(P121=\"\",\"\",IFERROR(INDIRECT(\"Postcodes!$C\"&SUMPRODUCT(--(Postcodes!$A$2:$A$100<=P121)*(Postcodes!$B$2:$B$100>=P121), ROW(Postcodes!$A$2:$A$100))),\"WRONG CODE\"))","v":0},null,null,null,null,null,null,""]
[{"$f":"'Order Form'!A142","v":121},{"$f":"'Order Form'!M142","v":""},{"$f":"'Order Form'!$E$4","v":0},{"$f":"'Order Form'!$E$5","v":0},{"$f":"'Order Form'!$E$6","v":0},{"$f":"'Order Form'!$E$7","v":0},{"$f":"'Order Form'!$E$9","v":0},{"$f":"'Order Form'!$E$8","v":0},{"$f":"'Order Form'!$E$10","v":0},{"$f":"'Order Form'!$E$11","v":0},{"$f":"IF(('Order Form'!$E$15=\"YES\"),'Order Form'!$E$12,\"\")","v":0},{"$f":"'Order Form'!$E$13 & \"\"","v":""},{"$f":"IF('Order Form'!D142=\"\",'Order Form'!C142,'Order Form'!D142) & \"\"","v":""},{"$f":"'Order Form'!E142 & \"\"","v":""},{"$f":"'Order Form'!F142","v":0},{"$f":"'Order Form'!I142","v":0},{"$f":"'Order Form'!G142","v":0},{"$f":"'Order Form'!H142","v":0},{"$f":"'Order Form'!J142 & \"\"","v":""},{"$f":"'Order Form'!L142 & \"\"","v":""},{"$f":"'Order Form'!C142 & \"\"","v":""},{"$f":"'Order Form'!K142 & \"\"","v":""},{"$f":"'Order Form'!$E$14","v":"YES"},{"$f":"'Order Form'!$E$19","v":0},{"$f":"'Order Form'!$E$16","v":"FREE gift card"},{"$f":"'Order Form'!$E$17","v":"No thanks"},"No","No",{"$f":"\"Dispatch Week: \"&'Order Form'!$E$18","v":"Dispatch Week: "},{"$f":"\"VIP: \"&'Order Form'!$E$5 &\"; Rib: \"&'Order Form'!$E$17 &\"; GT: \"&'Order Form'!$E$16","v":"VIP: ; Rib: No thanks; GT: FREE gift card"},null,null,null,{"$f":"IF(P122=\"\",\"\",IFERROR(INDIRECT(\"Postcodes!$C\"&SUMPRODUCT(--(Postcodes!$A$2:$A$100<=P122)*(Postcodes!$B$2:$B$100>=P122), ROW(Postcodes!$A$2:$A$100))),\"WRONG CODE\"))","v":0},null,null,null,null,null,null,""]
[{"$f":"'Order Form'!A143","v":122},{"$f":"'Order Form'!M143","v":""},{"$f":"'Order Form'!$E$4","v":0},{"$f":"'Order Form'!$E$5","v":0},{"$f":"'Order Form'!$E$6","v":0},{"$f":"'Order Form'!$E$7","v":0},{"$f":"'Order Form'!$E$9","v":0},{"$f":"'Order Form'!$E$8","v":0},{"$f":"'Order Form'!$E$10","v":0},{"$f":"'Order Form'!$E$11","v":0},{"$f":"IF(('Order Form'!$E$15=\"YES\"),'Order Form'!$E$12,\"\")","v":0},{"$f":"'Order Form'!$E$13 & \"\"","v":""},{"$f":"IF('Order Form'!D143=\"\",'Order Form'!C143,'Order Form'!D143) & \"\"","v":""},{"$f":"'Order Form'!E143 & \"\"","v":""},{"$f":"'Order Form'!F143","v":0},{"$f":"'Order Form'!I143","v":0},{"$f":"'Order Form'!G143","v":0},{"$f":"'Order Form'!H143","v":0},{"$f":"'Order Form'!J143 & \"\"","v":""},{"$f":"'Order Form'!L143 & \"\"","v":""},{"$f":"'Order Form'!C143 & \"\"","v":""},{"$f":"'Order Form'!K143 & \"\"","v":""},{"$f":"'Order Form'!$E$14","v":"YES"},{"$f":"'Order Form'!$E$19","v":0},{"$f":"'Order Form'!$E$16","v":"FREE gift card"},{"$f":"'Order Form'!$E$17","v":"No thanks"},"No","No",{"$f":"\"Dispatch Week: \"&'Order Form'!$E$18","v":"Dispatch Week: "},{"$f":"\"VIP: \"&'Order Form'!$E$5 &\"; Rib: \"&'Order Form'!$E$17 &\"; GT: \"&'Order Form'!$E$16","v":"VIP: ; Rib: No thanks; GT: FREE gift card"},null,null,null,{"$f":"IF(P123=\"\",\"\",IFERROR(INDIRECT(\"Postcodes!$C\"&SUMPRODUCT(--(Postcodes!$A$2:$A$100<=P123)*(Postcodes!$B$2:$B$100>=P123), ROW(Postcodes!$A$2:$A$100))),\"WRONG CODE\"))","v":0},null,null,null,null,null,null,""]
[{"$f":"'Order Form'!A144","v":123},{"$f":"'Order Form'!M144","v":""},{"$f":"'Order Form'!$E$4","v":0},{"$f":"'Order Form'!$E$5","v":0},{"$f":"'Order Form'!$E$6","v":0},{"$f":"'Order Form'!$E$7","v":0},{"$f":"'Order Form'!$E$9","v":0},{"$f":"'Order Form'!$E$8","v":0},{"$f":"'Order Form'!$E$10","v":0},{"$f":"'Order Form'!$E$11","v":0},{"$f":"IF(('Order Form'!$E$15=\"YES\"),'Order Form'!$E$12,\"\")","v":0},{"$f":"'Order Form'!$E$13 & \"\"","v":""},{"$f":"IF('Order Form'!D144=\"\",'Order Form'!C144,'Order Form'!D144) & \"\"","v":""},{"$f":"'Order Form'!E144 & \"\"","v":""},{"$f":"'Order Form'!F144","v":0},{"$f":"'Order Form'!I144","v":0},{"$f":"'Order Form'!G144","v":0},{"$f":"'Order Form'!H144","v":0},{"$f":"'Order Form'!J144 & \"\"","v":""},{"$f":"'Order Form'!L144 & \"\"","v":""},{"$f":"'Order Form'!C144 & \"\"","v":""},{"$f":"'Order Form'!K144 & \"\"","v":""},{"$f":"'Order Form'!$E$14","v":"YES"},{"$f":"'Order Form'!$E$19","v":0},{"$f":"'Order Form'!$E$16","v":"FREE gift card"},{"$f":"'Order Form'!$E$17","v":"No thanks"},"No","No",{"$f":"\"Dispatch Week: \"&'Order Form'!$E$18","v":"Dispatch Week: "},{"$f":"\"VIP: \"&'Order Form'!$E$5 &\"; Rib: \"&'Order Form'!$E$17 &\"; GT: \"&'Order Form'!$E$16","v":"VIP: ; Rib: No thanks; GT: FREE gift card"},null,null,null,{"$f":"IF(P124=\"\",\"\",IFERROR(INDIRECT(\"Postcodes!$C\"&SUMPRODUCT(--(Postcodes!$A$2:$A$100<=P124)*(Postcodes!$B$2:$B$100>=P124), ROW(Postcodes!$A$2:$A$100))),\"WRONG CODE\"))","v":0},null,null,null,null,null,null,""]
[{"$f":"'Order Form'!A145","v":124},{"$f":"'Order Form'!M145","v":""},{"$f":"'Order Form'!$E$4","v":0},{"$f":"'Order Form'!$E$5","v":0},{"$f":"'Order Form'!$E$6","v":0},{"$f":"'Order Form'!$E$7","v":0},{"$f":"'Order Form'!$E$9","v":0},{"$f":"'Order Form'!$E$8","v":0},{"$f":"'Order Form'!$E$10","v":0},{"$f":"'Order Form'!$E$11","v":0},{"$f":"IF(('Order Form'!$E$15=\"YES\"),'Order Form'!$E$12,\"\")","v":0},{"$f":"'Order Form'!$E$13 & \"\"","v":""},{"$f":"IF('Order Form'!D145=\"\",'Order Form'!C145,'Order Form'!D145) & \"\"","v":""},{"$f":"'Order Form'!E145 & \"\"","v":""},{"$f":"'Order Form'!F145","v":0},{"$f":"'Order Form'!I145","v":0},{"$f":"'Order Form'!G145","v":0},{"$f":"'Order Form'!H145","v":0},{"$f":"'Order Form'!J145 & \"\"","v":""},{"$f":"'Order Form'!L145 & \"\"","v":""},{"$f":"'Order Form'!C145 & \"\"","v":""},{"$f":"'Order Form'!K145 & \"\"","v":""},{"$f":"'Order Form'!$E$14","v":"YES"},{"$f":"'Order Form'!$E$19","v":0},{"$f":"'Order Form'!$E$16","v":"FREE gift card"},{"$f":"'Order Form'!$E$17","v":"No thanks"},"No","No",{"$f":"\"Dispatch Week: \"&'Order Form'!$E$18","v":"Dispatch Week: "},{"$f":"\"VIP: \"&'Order Form'!$E$5 &\"; Rib: \"&'Order Form'!$E$17 &\"; GT: \"&'Order Form'!$E$16","v":"VIP: ; Rib: No thanks; GT: FREE gift card"},null,null,null,{"$f":"IF(P125=\"\",\"\",IFERROR(INDIRECT(\"Postcodes!$C\"&SUMPRODUCT(--(Postcodes!$A$2:$A$100<=P125)*(Postcodes!$B$2:$B$100>=P125), ROW(Postcodes!$A$2:$A$100))),\"WRONG CODE\"))","v":0},null,null,null,null,null,null,""]
[{"$f":"'Order Form'!A146","v":125},{"$f":"'Order Form'!M146","v":""},{"$f":"'Order Form'!$E$4","v":0},{"$f":"'Order Form'!$E$5","v":0},{"$f":"'Order Form'!$E$6","v":0},{"$f":"'Order Form'!$E$7","v":0},{"$f":"'Order Form'!$E$9","v":0},{"$f":"'Order Form'!$E$8","v":0},{"$f":"'Order Form'!$E$10","v":0},{"$f":"'Order Form'!$E$11","v":0},{"$f":"IF(('Order Form'!$E$15=\"YES\"),'Order Form'!$E$12,\"\")","v":0},{"$f":"'Order Form'!$E$13 & \"\"","v":""},{"$f":"IF('Order Form'!D146=\"\",'Order Form'!C146,'Order Form'!D146) & \"\"","v":""},{"$f":"'Order Form'!E146 & \"\"","v":""},{"$f":"'Order Form'!F146","v":0},{"$f":"'Order Form'!I146","v":0},{"$f":"'Order Form'!G146","v":0},{"$f":"'Order Form'!H146","v":0},{"$f":"'Order Form'!J146 & \"\"","v":""},{"$f":"'Order Form'!L146 & \"\"","v":""},{"$f":"'Order Form'!C146 & \"\"","v":""},{"$f":"'Order Form'!K146 & \"\"","v":""},{"$f":"'Order Form'!$E$14","v":"YES"},{"$f":"'Order Form'!$E$19","v":0},{"$f":"'Order Form'!$E$16","v":"FREE gift card"},{"$f":"'Order Form'!$E$17","v":"No thanks"},"No","No",{"$f":"\"Dispatch Week: \"&'Order Form'!$E$18","v":"Dispatch Week: "},{"$f":"\"VIP: \"&'Order Form'!$E$5 &\"; Rib: \"&'Order Form'!$E$17 &\"; GT: \"&'Order Form'!$E$16","v":"VIP: ; Rib: No thanks; GT: FREE gift card"},null,null,null,{"$f":"IF(P126=\"\",\"\",IFERROR(INDIRECT(\"Postcodes!$C\"&SUMPRODUCT(--(Postcodes!$A$2:$A$100<=P126)*(Postcodes!$B$2:$B$100>=P126), ROW(Postcodes!$A$2:$A$100))),\"WRONG CODE\"))","v":0},null,null,null,null,null,null,""]
[{"$f":"'Order Form'!A147","v":126},{"$f":"'Order Form'!M147","v":""},{"$f":"'Order Form'!$E$4","v":0},{"$f":"'Order Form'!$E$5","v":0},{"$f":"'Order Form'!$E$6","v":0},{"$f":"'Order Form'!$E$7","v":0},{"$f":"'Order Form'!$E$9","v":0},{"$f":"'Order Form'!$E$8","v":0},{"$f":"'Order Form'!$E$10","v":0},{"$f":"'Order Form'!$E$11","v":0},{"$f":"IF(('Order Form'!$E$15=\"YES\"),'Order Form'!$E$12,\"\")","v":0},{"$f":"'Order Form'!$E$13 & \"\"","v":""},{"$f":"IF('Order Form'!D147=\"\",'Order Form'!C147,'Order Form'!D147) & \"\"","v":""},{"$f":"'Order Form'!E147 & \"\"","v":""},{"$f":"'Order Form'!F147","v":0},{"$f":"'Order Form'!I147","v":0},{"$f":"'Order Form'!G147","v":0},{"$f":"'Order Form'!H147","v":0},{"$f":"'Order Form'!J147 & \"\"","v":""},{"$f":"'Order Form'!L147 & \"\"","v":""},{"$f":"'Order Form'!C147 & \"\"","v":""},{"$f":"'Order Form'!K147 & \"\"","v":""},{"$f":"'Order Form'!$E$14","v":"YES"},{"$f":"'Order Form'!$E$19","v":0},{"$f":"'Order Form'!$E$16","v":"FREE gift card"},{"$f":"'Order Form'!$E$17","v":"No thanks"},"No","No",{"$f":"\"Dispatch Week: \"&'Order Form'!$E$18","v":"Dispatch Week: "},{"$f":"\"VIP: \"&'Order Form'!$E$5 &\"; Rib: \"&'Order Form'!$E$17 &\"; GT: \"&'Order Form'!$E$16","v":"VIP: ; Rib: No thanks; GT: FREE gift card"},null,null,null,{"$f":"IF(P127=\"\",\"\",IFERROR(INDIRECT(\"Postcodes!$C\"&SUMPRODUCT(--(Postcodes!$A$2:$A$100<=P127)*(Postcodes!$B$2:$B$100>=P127), ROW(Postcodes!$A$2:$A$100))),\"WRONG CODE\"))","v":0},null,null,null,null,null,null,""]
[{"$f":"'Order Form'!A148","v":127},{"$f":"'Order Form'!M148","v":""},{"$f":"'Order Form'!$E$4","v":0},{"$f":"'Order Form'!$E$5","v":0},{"$f":"'Order Form'!$E$6","v":0},{"$f":"'Order Form'!$E$7","v":0},{"$f":"'Order Form'!$E$9","v":0},{"$f":"'Order Form'!$E$8","v":0},{"$f":"'Order Form'!$E$10","v":0},{"$f":"'Order Form'!$E$11","v":0},{"$f":"IF(('Order Form'!$E$15=\"YES\"),'Order Form'!$E$12,\"\")","v":0},{"$f":"'Order Form'!$E$13 & \"\"","v":""},{"$f":"IF('Order Form'!D148=\"\",'Order Form'!C148,'Order Form'!D148) & \"\"","v":""},{"$f":"'Order Form'!E148 & \"\"","v":""},{"$f":"'Order Form'!F148","v":0},{"$f":"'Order Form'!I148","v":0},{"$f":"'Order Form'!G148","v":0},{"$f":"'Order Form'!H148","v":0},{"$f":"'Order Form'!J148 & \"\"","v":""},{"$f":"'Order Form'!L148 & \"\"","v":""},{"$f":"'Order Form'!C148 & \"\"","v":""},{"$f":"'Order Form'!K148 & \"\"","v":""},{"$f":"'Order Form'!$E$14","v":"YES"},{"$f":"'Order Form'!$E$19","v":0},{"$f":"'Order Form'!$E$16","v":"FREE gift card"},{"$f":"'Order Form'!$E$17","v":"No thanks"},"No","No",{"$f":"\"Dispatch Week: \"&'Order Form'!$E$18","v":"Dispatch Week: "},{"$f":"\"VIP: \"&'Order Form'!$E$5 &\"; Rib: \"&'Order Form'!$E$17 &\"; GT: \"&'Order Form'!$E$16","v":"VIP: ; Rib: No thanks; GT: FREE gift card"},null,null,null,{"$f":"IF(P128=\"\",\"\",IFERROR(INDIRECT(\"Postcodes!$C\"&SUMPRODUCT(--(Postcodes!$A$2:$A$100<=P128)*(Postcodes!$B$2:$B$100>=P128), ROW(Postcodes!$A$2:$A$100))),\"WRONG CODE\"))","v":0},null,null,null,null,null,null,""]
[{"$f":"'Order Form'!A149","v":128},{"$f":"'Order Form'!M149","v":""},{"$f":"'Order Form'!$E$4","v":0},{"$f":"'Order Form'!$E$5","v":0},{"$f":"'Order Form'!$E$6","v":0},{"$f":"'Order Form'!$E$7","v":0},{"$f":"'Order Form'!$E$9","v":0},{"$f":"'Order Form'!$E$8","v":0},{"$f":"'Order Form'!$E$10","v":0},{"$f":"'Order Form'!$E$11","v":0},{"$f":"IF(('Order Form'!$E$15=\"YES\"),'Order Form'!$E$12,\"\")","v":0},{"$f":"'Order Form'!$E$13 & \"\"","v":""},{"$f":"IF('Order Form'!D149=\"\",'Order Form'!C149,'Order Form'!D149) & \"\"","v":""},{"$f":"'Order Form'!E149 & \"\"","v":""},{"$f":"'Order Form'!F149","v":0},{"$f":"'Order Form'!I149","v":0},{"$f":"'Order Form'!G149","v":0},{"$f":"'Order Form'!H149","v":0},{"$f":"'Order Form'!J149 & \"\"","v":""},{"$f":"'Order Form'!L149 & \"\"","v":""},{"$f":"'Order Form'!C149 & \"\"","v":""},{"$f":"'Order Form'!K149 & \"\"","v":""},{"$f":"'Order Form'!$E$14","v":"YES"},{"$f":"'Order Form'!$E$19","v":0},{"$f":"'Order Form'!$E$16","v":"FREE gift card"},{"$f":"'Order Form'!$E$17","v":"No thanks"},"No","No",{"$f":"\"Dispatch Week: \"&'Order Form'!$E$18","v":"Dispatch Week: "},{"$f":"\"VIP: \"&'Order Form'!$E$5 &\"; Rib: \"&'Order Form'!$E$17 &\"; GT: \"&'Order Form'!$E$16","v":"VIP: ; Rib: No thanks; GT: FREE gift card"},null,null,null,{"$f":"IF(P129=\"\",\"\",IFERROR(INDIRECT(\"Postcodes!$C\"&SUMPRODUCT(--(Postcodes!$A$2:$A$100<=P129)*(Postcodes!$B$2:$B$100>=P129), ROW(Postcodes!$A$2:$A$100))),\"WRONG CODE\"))","v":0},null,null,null,null,null,null,""]
[{"$f":"'Order Form'!A150","v":129},{"$f":"'Order Form'!M150","v":""},{"$f":"'Order Form'!$E$4","v":0},{"$f":"'Order Form'!$E$5","v":0},{"$f":"'Order Form'!$E$6","v":0},{"$f":"'Order Form'!$E$7","v":0},{"$f":"'Order Form'!$E$9","v":0},{"$f":"'Order Form'!$E$8","v":0},{"$f":"'Order Form'!$E$10","v":0},{"$f":"'Order Form'!$E$11","v":0},{"$f":"IF(('Order Form'!$E$15=\"YES\"),'Order Form'!$E$12,\"\")","v":0},{"$f":"'Order Form'!$E$13 & \"\"","v":""},{"$f":"IF('Order Form'!D150=\"\",'Order Form'!C150,'Order Form'!D150) & \"\"","v":""},{"$f":"'Order Form'!E150 & \"\"","v":""},{"$f":"'Order Form'!F150","v":0},{"$f":"'Order Form'!I150","v":0},{"$f":"'Order Form'!G150","v":0},{"$f":"'Order Form'!H150","v":0},{"$f":"'Order Form'!J150 & \"\"","v":""},{"$f":"'Order Form'!L150 & \"\"","v":""},{"$f":"'Order Form'!C150 & \"\"","v":""},{"$f":"'Order Form'!K150 & \"\"","v":""},{"$f":"'Order Form'!$E$14","v":"YES"},{"$f":"'Order Form'!$E$19","v":0},{"$f":"'Order Form'!$E$16","v":"FREE gift card"},{"$f":"'Order Form'!$E$17","v":"No thanks"},"No","No",{"$f":"\"Dispatch Week: \"&'Order Form'!$E$18","v":"Dispatch Week: "},{"$f":"\"VIP: \"&'Order Form'!$E$5 &\"; Rib: \"&'Order Form'!$E$17 &\"; GT: \"&'Order Form'!$E$16","v":"VIP: ; Rib: No thanks; GT: FREE gift card"},null,null,null,{"$f":"IF(P130=\"\",\"\",IFERROR(INDIRECT(\"Postcodes!$C\"&SUMPRODUCT(--(Postcodes!$A$2:$A$100<=P130)*(Postcodes!$B$2:$B$100>=P130), ROW(Postcodes!$A$2:$A$100))),\"WRONG CODE\"))","v":0},null,null,null,null,null,null,""]
[{"$f":"'Order Form'!A151","v":130},{"$f":"'Order Form'!M151","v":""},{"$f":"'Order Form'!$E$4","v":0},{"$f":"'Order Form'!$E$5","v":0},{"$f":"'Order Form'!$E$6","v":0},{"$f":"'Order Form'!$E$7","v":0},{"$f":"'Order Form'!$E$9","v":0},{"$f":"'Order Form'!$E$8","v":0},{"$f":"'Order Form'!$E$10","v":0},{"$f":"'Order Form'!$E$11","v":0},{"$f":"IF(('Order Form'!$E$15=\"YES\"),'Order Form'!$E$12,\"\")","v":0},{"$f":"'Order Form'!$E$13 & \"\"","v":""},{"$f":"IF('Order Form'!D151=\"\",'Order Form'!C151,'Order Form'!D151) & \"\"","v":""},{"$f":"'Order Form'!E151 & \"\"","v":""},{"$f":"'Order Form'!F151","v":0},{"$f":"'Order Form'!I151","v":0},{"$f":"'Order Form'!G151","v":0},{"$f":"'Order Form'!H151","v":0},{"$f":"'Order Form'!J151 & \"\"","v":""},{"$f":"'Order Form'!L151 & \"\"","v":""},{"$f":"'Order Form'!C151 & \"\"","v":""},{"$f":"'Order Form'!K151 & \"\"","v":""},{"$f":"'Order Form'!$E$14","v":"YES"},{"$f":"'Order Form'!$E$19","v":0},{"$f":"'Order Form'!$E$16","v":"FREE gift card"},{"$f":"'Order Form'!$E$17","v":"No thanks"},{"$f":"IF(OR(Y131=\"FREE gift card\",Y131=\"No Cards\"),\"No\",\"Yes\")","v":"No"},{"$f":"IF($Z$2=\"No thanks\",\"No\",\"Yes\")","v":"No"},{"$f":"\"Dispatch Week: \"&'Order Form'!$E$18","v":"Dispatch Week: "},{"$f":"\"VIP: \"&'Order Form'!$E$5 &\"; Rib: \"&'Order Form'!$E$17 &\"; GT: \"&'Order Form'!$E$16","v":"VIP: ; Rib: No thanks; GT: FREE gift card"},null,null,null,{"$f":"IF(P131=\"\",\"\",IFERROR(INDIRECT(\"Postcodes!$C\"&SUMPRODUCT(--(Postcodes!$A$2:$A$100<=P131)*(Postcodes!$B$2:$B$100>=P131), ROW(Postcodes!$A$2:$A$100))),\"WRONG CODE\"))","v":0},null,null,null,null,null,null,{"$f":"IF(AND(X131=\"ASAP\",Y131=\"FREE gift card\",Z131=\"No Thanks\"),\"asap\",\"\")","v":""}]
[{"$f":"'Order Form'!A152","v":131},{"$f":"'Order Form'!M152","v":""},{"$f":"'Order Form'!$E$4","v":0},{"$f":"'Order Form'!$E$5","v":0},{"$f":"'Order Form'!$E$6","v":0},{"$f":"'Order Form'!$E$7","v":0},{"$f":"'Order Form'!$E$9","v":0},{"$f":"'Order Form'!$E$8","v":0},{"$f":"'Order Form'!$E$10","v":0},{"$f":"'Order Form'!$E$11","v":0},{"$f":"IF(('Order Form'!$E$15=\"YES\"),'Order Form'!$E$12,\"\")","v":0},{"$f":"'Order Form'!$E$13 & \"\"","v":""},{"$f":"IF('Order Form'!D152=\"\",'Order Form'!C152,'Order Form'!D152) & \"\"","v":""},{"$f":"'Order Form'!E152 & \"\"","v":""},{"$f":"'Order Form'!F152","v":0},{"$f":"'Order Form'!I152","v":0},{"$f":"'Order Form'!G152","v":0},{"$f":"'Order Form'!H152","v":0},{"$f":"'Order Form'!J152 & \"\"","v":""},{"$f":"'Order Form'!L152 & \"\"","v":""},{"$f":"'Order Form'!C152 & \"\"","v":""},{"$f":"'Order Form'!K152 & \"\"","v":""},{"$f":"'Order Form'!$E$14","v":"YES"},{"$f":"'Order Form'!$E$19","v":0},{"$f":"'Order Form'!$E$16","v":"FREE gift card"},{"$f":"'Order Form'!$E$17","v":"No thanks"},"No","No",{"$f":"\"Dispatch Week: \"&'Order Form'!$E$18","v":"Dispatch Week: "},{"$f":"\"VIP: \"&'Order Form'!$E$5 &\"; Rib: \"&'Order Form'!$E$17 &\"; GT: \"&'Order Form'!$E$16","v":"VIP: ; Rib: No thanks; GT: FREE gift card"},null,null,null,{"$f":"IF(P132=\"\",\"\",IFERROR(INDIRECT(\"Postcodes!$C\"&SUMPRODUCT(--(Postcodes!$A$2:$A$100<=P132)*(Postcodes!$B$2:$B$100>=P132), ROW(Postcodes!$A$2:$A$100))),\"WRONG CODE\"))","v":0},null,null,null,null,null,null,""]
[{"$f":"'Order Form'!A153","v":132},{"$f":"'Order Form'!M153","v":""},{"$f":"'Order Form'!$E$4","v":0},{"$f":"'Order Form'!$E$5","v":0},{"$f":"'Order Form'!$E$6","v":0},{"$f":"'Order Form'!$E$7","v":0},{"$f":"'Order Form'!$E$9","v":0},{"$f":"'Order Form'!$E$8","v":0},{"$f":"'Order Form'!$E$10","v":0},{"$f":"'Order Form'!$E$11","v":0},{"$f":"IF(('Order Form'!$E$15=\"YES\"),'Order Form'!$E$12,\"\")","v":0},{"$f":"'Order Form'!$E$13 & \"\"","v":""},{"$f":"IF('Order Form'!D153=\"\",'Order Form'!C153,'Order Form'!D153) & \"\"","v":""},{"$f":"'Order Form'!E153 & \"\"","v":""},{"$f":"'Order Form'!F153","v":0},{"$f":"'Order Form'!I153","v":0},{"$f":"'Order Form'!G153","v":0},{"$f":"'Order Form'!H153","v":0},{"$f":"'Order Form'!J153 & \"\"","v":""},{"$f":"'Order Form'!L153 & \"\"","v":""},{"$f":"'Order Form'!C153 & \"\"","v":""},{"$f":"'Order Form'!K153 & \"\"","v":""},{"$f":"'Order Form'!$E$14","v":"YES"},{"$f":"'Order Form'!$E$19","v":0},{"$f":"'Order Form'!$E$16","v":"FREE gift card"},{"$f":"'Order Form'!$E$17","v":"No thanks"},"No","No",{"$f":"\"Dispatch Week: \"&'Order Form'!$E$18","v":"Dispatch Week: "},{"$f":"\"VIP: \"&'Order Form'!$E$5 &\"; Rib: \"&'Order Form'!$E$17 &\"; GT: \"&'Order Form'!$E$16","v":"VIP: ; Rib: No thanks; GT: FREE gift card"},null,null,null,{"$f":"IF(P133=\"\",\"\",IFERROR(INDIRECT(\"Postcodes!$C\"&SUMPRODUCT(--(Postcodes!$A$2:$A$100<=P133)*(Postcodes!$B$2:$B$100>=P133), ROW(Postcodes!$A$2:$A$100))),\"WRONG CODE\"))","v":0},null,null,null,null,null,null,""]
[{"$f":"'Order Form'!A154","v":133},{"$f":"'Order Form'!M154","v":""},{"$f":"'Order Form'!$E$4","v":0},{"$f":"'Order Form'!$E$5","v":0},{"$f":"'Order Form'!$E$6","v":0},{"$f":"'Order Form'!$E$7","v":0},{"$f":"'Order Form'!$E$9","v":0},{"$f":"'Order Form'!$E$8","v":0},{"$f":"'Order Form'!$E$10","v":0},{"$f":"'Order Form'!$E$11","v":0},{"$f":"IF(('Order Form'!$E$15=\"YES\"),'Order Form'!$E$12,\"\")","v":0},{"$f":"'Order Form'!$E$13 & \"\"","v":""},{"$f":"IF('Order Form'!D154=\"\",'Order Form'!C154,'Order Form'!D154) & \"\"","v":""},{"$f":"'Order Form'!E154 & \"\"","v":""},{"$f":"'Order Form'!F154","v":0},{"$f":"'Order Form'!I154","v":0},{"$f":"'Order Form'!G154","v":0},{"$f":"'Order Form'!H154","v":0},{"$f":"'Order Form'!J154 & \"\"","v":""},{"$f":"'Order Form'!L154 & \"\"","v":""},{"$f":"'Order Form'!C154 & \"\"","v":""},{"$f":"'Order Form'!K154 & \"\"","v":""},{"$f":"'Order Form'!$E$14","v":"YES"},{"$f":"'Order Form'!$E$19","v":0},{"$f":"'Order Form'!$E$16","v":"FREE gift card"},{"$f":"'Order Form'!$E$17","v":"No thanks"},"No","No",{"$f":"\"Dispatch Week: \"&'Order Form'!$E$18","v":"Dispatch Week: "},{"$f":"\"VIP: \"&'Order Form'!$E$5 &\"; Rib: \"&'Order Form'!$E$17 &\"; GT: \"&'Order Form'!$E$16","v":"VIP: ; Rib: No thanks; GT: FREE gift card"},null,null,null,{"$f":"IF(P134=\"\",\"\",IFERROR(INDIRECT(\"Postcodes!$C\"&SUMPRODUCT(--(Postcodes!$A$2:$A$100<=P134)*(Postcodes!$B$2:$B$100>=P134), ROW(Postcodes!$A$2:$A$100))),\"WRONG CODE\"))","v":0},null,null,null,null,null,null,""]
[{"$f":"'Order Form'!A155","v":134},{"$f":"'Order Form'!M155","v":""},{"$f":"'Order Form'!$E$4","v":0},{"$f":"'Order Form'!$E$5","v":0},{"$f":"'Order Form'!$E$6","v":0},{"$f":"'Order Form'!$E$7","v":0},{"$f":"'Order Form'!$E$9","v":0},{"$f":"'Order Form'!$E$8","v":0},{"$f":"'Order Form'!$E$10","v":0},{"$f":"'Order Form'!$E$11","v":0},{"$f":"IF(('Order Form'!$E$15=\"YES\"),'Order Form'!$E$12,\"\")","v":0},{"$f":"'Order Form'!$E$13 & \"\"","v":""},{"$f":"IF('Order Form'!D155=\"\",'Order Form'!C155,'Order Form'!D155) & \"\"","v":""},{"$f":"'Order Form'!E155 & \"\"","v":""},{"$f":"'Order Form'!F155","v":0},{"$f":"'Order Form'!I155","v":0},{"$f":"'Order Form'!G155","v":0},{"$f":"'Order Form'!H155","v":0},{"$f":"'Order Form'!J155 & \"\"","v":""},{"$f":"'Order Form'!L155 & \"\"","v":""},{"$f":"'Order Form'!C155 & \"\"","v":""},{"$f":"'Order Form'!K155 & \"\"","v":""},{"$f":"'Order Form'!$E$14","v":"YES"},{"$f":"'Order Form'!$E$19","v":0},{"$f":"'Order Form'!$E$16","v":"FREE gift card"},{"$f":"'Order Form'!$E$17","v":"No thanks"},"No","No",{"$f":"\"Dispatch Week: \"&'Order Form'!$E$18","v":"Dispatch Week: "},{"$f":"\"VIP: \"&'Order Form'!$E$5 &\"; Rib: \"&'Order Form'!$E$17 &\"; GT: \"&'Order Form'!$E$16","v":"VIP: ; Rib: No thanks; GT: FREE gift card"},null,null,null,{"$f":"IF(P135=\"\",\"\",IFERROR(INDIRECT(\"Postcodes!$C\"&SUMPRODUCT(--(Postcodes!$A$2:$A$100<=P135)*(Postcodes!$B$2:$B$100>=P135), ROW(Postcodes!$A$2:$A$100))),\"WRONG CODE\"))","v":0},null,null,null,null,null,null,""]
[{"$f":"'Order Form'!A156","v":135},{"$f":"'Order Form'!M156","v":""},{"$f":"'Order Form'!$E$4","v":0},{"$f":"'Order Form'!$E$5","v":0},{"$f":"'Order Form'!$E$6","v":0},{"$f":"'Order Form'!$E$7","v":0},{"$f":"'Order Form'!$E$9","v":0},{"$f":"'Order Form'!$E$8","v":0},{"$f":"'Order Form'!$E$10","v":0},{"$f":"'Order Form'!$E$11","v":0},{"$f":"IF(('Order Form'!$E$15=\"YES\"),'Order Form'!$E$12,\"\")","v":0},{"$f":"'Order Form'!$E$13 & \"\"","v":""},{"$f":"IF('Order Form'!D156=\"\",'Order Form'!C156,'Order Form'!D156) & \"\"","v":""},{"$f":"'Order Form'!E156 & \"\"","v":""},{"$f":"'Order Form'!F156","v":0},{"$f":"'Order Form'!I156","v":0},{"$f":"'Order Form'!G156","v":0},{"$f":"'Order Form'!H156","v":0},{"$f":"'Order Form'!J156 & \"\"","v":""},{"$f":"'Order Form'!L156 & \"\"","v":""},{"$f":"'Order Form'!C156 & \"\"","v":""},{"$f":"'Order Form'!K156 & \"\"","v":""},{"$f":"'Order Form'!$E$14","v":"YES"},{"$f":"'Order Form'!$E$19","v":0},{"$f":"'Order Form'!$E$16","v":"FREE gift card"},{"$f":"'Order Form'!$E$17","v":"No thanks"},"No","No",{"$f":"\"Dispatch Week: \"&'Order Form'!$E$18","v":"Dispatch Week: "},{"$f":"\"VIP: \"&'Order Form'!$E$5 &\"; Rib: \"&'Order Form'!$E$17 &\"; GT: \"&'Order Form'!$E$16","v":"VIP: ; Rib: No thanks; GT: FREE gift card"},null,null,null,{"$f":"IF(P136=\"\",\"\",IFERROR(INDIRECT(\"Postcodes!$C\"&SUMPRODUCT(--(Postcodes!$A$2:$A$100<=P136)*(Postcodes!$B$2:$B$100>=P136), ROW(Postcodes!$A$2:$A$100))),\"WRONG CODE\"))","v":0},null,null,null,null,null,null,""]
[{"$f":"'Order Form'!A157","v":136},{"$f":"'Order Form'!M157","v":""},{"$f":"'Order Form'!$E$4","v":0},{"$f":"'Order Form'!$E$5","v":0},{"$f":"'Order Form'!$E$6","v":0},{"$f":"'Order Form'!$E$7","v":0},{"$f":"'Order Form'!$E$9","v":0},{"$f":"'Order Form'!$E$8","v":0},{"$f":"'Order Form'!$E$10","v":0},{"$f":"'Order Form'!$E$11","v":0},{"$f":"IF(('Order Form'!$E$15=\"YES\"),'Order Form'!$E$12,\"\")","v":0},{"$f":"'Order Form'!$E$13 & \"\"","v":""},{"$f":"IF('Order Form'!D157=\"\",'Order Form'!C157,'Order Form'!D157) & \"\"","v":""},{"$f":"'Order Form'!E157 & \"\"","v":""},{"$f":"'Order Form'!F157","v":0},{"$f":"'Order Form'!I157","v":0},{"$f":"'Order Form'!G157","v":0},{"$f":"'Order Form'!H157","v":0},{"$f":"'Order Form'!J157 & \"\"","v":""},{"$f":"'Order Form'!L157 & \"\"","v":""},{"$f":"'Order Form'!C157 & \"\"","v":""},{"$f":"'Order Form'!K157 & \"\"","v":""},{"$f":"'Order Form'!$E$14","v":"YES"},{"$f":"'Order Form'!$E$19","v":0},{"$f":"'Order Form'!$E$16","v":"FREE gift card"},{"$f":"'Order Form'!$E$17","v":"No thanks"},"No","No",{"$f":"\"Dispatch Week: \"&'Order Form'!$E$18","v":"Dispatch Week: "},{"$f":"\"VIP: \"&'Order Form'!$E$5 &\"; Rib: \"&'Order Form'!$E$17 &\"; GT: \"&'Order Form'!$E$16","v":"VIP: ; Rib: No thanks; GT: FREE gift card"},null,null,null,{"$f":"IF(P137=\"\",\"\",IFERROR(INDIRECT(\"Postcodes!$C\"&SUMPRODUCT(--(Postcodes!$A$2:$A$100<=P137)*(Postcodes!$B$2:$B$100>=P137), ROW(Postcodes!$A$2:$A$100))),\"WRONG CODE\"))","v":0},null,null,null,null,null,null,""]
[{"$f":"'Order Form'!A158","v":137},{"$f":"'Order Form'!M158","v":""},{"$f":"'Order Form'!$E$4","v":0},{"$f":"'Order Form'!$E$5","v":0},{"$f":"'Order Form'!$E$6","v":0},{"$f":"'Order Form'!$E$7","v":0},{"$f":"'Order Form'!$E$9","v":0},{"$f":"'Order Form'!$E$8","v":0},{"$f":"'Order Form'!$E$10","v":0},{"$f":"'Order Form'!$E$11","v":0},{"$f":"IF(('Order Form'!$E$15=\"YES\"),'Order Form'!$E$12,\"\")","v":0},{"$f":"'Order Form'!$E$13 & \"\"","v":""},{"$f":"IF('Order Form'!D158=\"\",'Order Form'!C158,'Order Form'!D158) & \"\"","v":""},{"$f":"'Order Form'!E158 & \"\"","v":""},{"$f":"'Order Form'!F158","v":0},{"$f":"'Order Form'!I158","v":0},{"$f":"'Order Form'!G158","v":0},{"$f":"'Order Form'!H158","v":0},{"$f":"'Order Form'!J158 & \"\"","v":""},{"$f":"'Order Form'!L158 & \"\"","v":""},{"$f":"'Order Form'!C158 & \"\"","v":""},{"$f":"'Order Form'!K158 & \"\"","v":""},{"$f":"'Order Form'!$E$14","v":"YES"},{"$f":"'Order Form'!$E$19","v":0},{"$f":"'Order Form'!$E$16","v":"FREE gift card"},{"$f":"'Order Form'!$E$17","v":"No thanks"},"No","No",{"$f":"\"Dispatch Week: \"&'Order Form'!$E$18","v":"Dispatch Week: "},{"$f":"\"VIP: \"&'Order Form'!$E$5 &\"; Rib: \"&'Order Form'!$E$17 &\"; GT: \"&'Order Form'!$E$16","v":"VIP: ; Rib: No thanks; GT: FREE gift card"},null,null,null,{"$f":"IF(P138=\"\",\"\",IFERROR(INDIRECT(\"Postcodes!$C\"&SUMPRODUCT(--(Postcodes!$A$2:$A$100<=P138)*(Postcodes!$B$2:$B$100>=P138), ROW(Postcodes!$A$2:$A$100))),\"WRONG CODE\"))","v":0},null,null,null,null,null,null,""]
[{"$f":"'Order Form'!A159","v":138},{"$f":"'Order Form'!M159","v":""},{"$f":"'Order Form'!$E$4","v":0},{"$f":"'Order Form'!$E$5","v":0},{"$f":"'Order Form'!$E$6","v":0},{"$f":"'Order Form'!$E$7","v":0},{"$f":"'Order Form'!$E$9","v":0},{"$f":"'Order Form'!$E$8","v":0},{"$f":"'Order Form'!$E$10","v":0},{"$f":"'Order Form'!$E$11","v":0},{"$f":"IF(('Order Form'!$E$15=\"YES\"),'Order Form'!$E$12,\"\")","v":0},{"$f":"'Order Form'!$E$13 & \"\"","v":""},{"$f":"IF('Order Form'!D159=\"\",'Order Form'!C159,'Order Form'!D159) & \"\"","v":""},{"$f":"'Order Form'!E159 & \"\"","v":""},{"$f":"'Order Form'!F159","v":0},{"$f":"'Order Form'!I159","v":0},{"$f":"'Order Form'!G159","v":0},{"$f":"'Order Form'!H159","v":0},{"$f":"'Order Form'!J159 & \"\"","v":""},{"$f":"'Order Form'!L159 & \"\"","v":""},{"$f":"'Order Form'!C159 & \"\"","v":""},{"$f":"'Order Form'!K159 & \"\"","v":""},{"$f":"'Order Form'!$E$14","v":"YES"},{"$f":"'Order Form'!$E$19","v":0},{"$f":"'Order Form'!$E$16","v":"FREE gift card"},{"$f":"'Order Form'!$E$17","v":"No thanks"},"No","No",{"$f":"\"Dispatch Week: \"&'Order Form'!$E$18","v":"Dispatch Week: "},{"$f":"\"VIP: \"&'Order Form'!$E$5 &\"; Rib: \"&'Order Form'!$E$17 &\"; GT: \"&'Order Form'!$E$16","v":"VIP: ; Rib: No thanks; GT: FREE gift card"},null,null,null,{"$f":"IF(P139=\"\",\"\",IFERROR(INDIRECT(\"Postcodes!$C\"&SUMPRODUCT(--(Postcodes!$A$2:$A$100<=P139)*(Postcodes!$B$2:$B$100>=P139), ROW(Postcodes!$A$2:$A$100))),\"WRONG CODE\"))","v":0},null,null,null,null,null,null,""]
[{"$f":"'Order Form'!A160","v":139},{"$f":"'Order Form'!M160","v":""},{"$f":"'Order Form'!$E$4","v":0},{"$f":"'Order Form'!$E$5","v":0},{"$f":"'Order Form'!$E$6","v":0},{"$f":"'Order Form'!$E$7","v":0},{"$f":"'Order Form'!$E$9","v":0},{"$f":"'Order Form'!$E$8","v":0},{"$f":"'Order Form'!$E$10","v":0},{"$f":"'Order Form'!$E$11","v":0},{"$f":"IF(('Order Form'!$E$15=\"YES\"),'Order Form'!$E$12,\"\")","v":0},{"$f":"'Order Form'!$E$13 & \"\"","v":""},{"$f":"IF('Order Form'!D160=\"\",'Order Form'!C160,'Order Form'!D160) & \"\"","v":""},{"$f":"'Order Form'!E160 & \"\"","v":""},{"$f":"'Order Form'!F160","v":0},{"$f":"'Order Form'!I160","v":0},{"$f":"'Order Form'!G160","v":0},{"$f":"'Order Form'!H160","v":0},{"$f":"'Order Form'!J160 & \"\"","v":""},{"$f":"'Order Form'!L160 & \"\"","v":""},{"$f":"'Order Form'!C160 & \"\"","v":""},{"$f":"'Order Form'!K160 & \"\"","v":""},{"$f":"'Order Form'!$E$14","v":"YES"},{"$f":"'Order Form'!$E$19","v":0},{"$f":"'Order Form'!$E$16","v":"FREE gift card"},{"$f":"'Order Form'!$E$17","v":"No thanks"},"No","No",{"$f":"\"Dispatch Week: \"&'Order Form'!$E$18","v":"Dispatch Week: "},{"$f":"\"VIP: \"&'Order Form'!$E$5 &\"; Rib: \"&'Order Form'!$E$17 &\"; GT: \"&'Order Form'!$E$16","v":"VIP: ; Rib: No thanks; GT: FREE gift card"},null,null,null,{"$f":"IF(P140=\"\",\"\",IFERROR(INDIRECT(\"Postcodes!$C\"&SUMPRODUCT(--(Postcodes!$A$2:$A$100<=P140)*(Postcodes!$B$2:$B$100>=P140), ROW(Postcodes!$A$2:$A$100))),\"WRONG CODE\"))","v":0},null,null,null,null,null,null,""]
[{"$f":"'Order Form'!A161","v":140},{"$f":"'Order Form'!M161","v":""},{"$f":"'Order Form'!$E$4","v":0},{"$f":"'Order Form'!$E$5","v":0},{"$f":"'Order Form'!$E$6","v":0},{"$f":"'Order Form'!$E$7","v":0},{"$f":"'Order Form'!$E$9","v":0},{"$f":"'Order Form'!$E$8","v":0},{"$f":"'Order Form'!$E$10","v":0},{"$f":"'Order Form'!$E$11","v":0},{"$f":"IF(('Order Form'!$E$15=\"YES\"),'Order Form'!$E$12,\"\")","v":0},{"$f":"'Order Form'!$E$13 & \"\"","v":""},{"$f":"IF('Order Form'!D161=\"\",'Order Form'!C161,'Order Form'!D161) & \"\"","v":""},{"$f":"'Order Form'!E161 & \"\"","v":""},{"$f":"'Order Form'!F161","v":0},{"$f":"'Order Form'!I161","v":0},{"$f":"'Order Form'!G161","v":0},{"$f":"'Order Form'!H161","v":0},{"$f":"'Order Form'!J161 & \"\"","v":""},{"$f":"'Order Form'!L161 & \"\"","v":""},{"$f":"'Order Form'!C161 & \"\"","v":""},{"$f":"'Order Form'!K161 & \"\"","v":""},{"$f":"'Order Form'!$E$14","v":"YES"},{"$f":"'Order Form'!$E$19","v":0},{"$f":"'Order Form'!$E$16","v":"FREE gift card"},{"$f":"'Order Form'!$E$17","v":"No thanks"},"No","No",{"$f":"\"Dispatch Week: \"&'Order Form'!$E$18","v":"Dispatch Week: "},{"$f":"\"VIP: \"&'Order Form'!$E$5 &\"; Rib: \"&'Order Form'!$E$17 &\"; GT: \"&'Order Form'!$E$16","v":"VIP: ; Rib: No thanks; GT: FREE gift card"},null,null,null,{"$f":"IF(P141=\"\",\"\",IFERROR(INDIRECT(\"Postcodes!$C\"&SUMPRODUCT(--(Postcodes!$A$2:$A$100<=P141)*(Postcodes!$B$2:$B$100>=P141), ROW(Postcodes!$A$2:$A$100))),\"WRONG CODE\"))","v":0},null,null,null,null,null,null,""]
[{"$f":"'Order Form'!A162","v":141},{"$f":"'Order Form'!M162","v":""},{"$f":"'Order Form'!$E$4","v":0},{"$f":"'Order Form'!$E$5","v":0},{"$f":"'Order Form'!$E$6","v":0},{"$f":"'Order Form'!$E$7","v":0},{"$f":"'Order Form'!$E$9","v":0},{"$f":"'Order Form'!$E$8","v":0},{"$f":"'Order Form'!$E$10","v":0},{"$f":"'Order Form'!$E$11","v":0},{"$f":"IF(('Order Form'!$E$15=\"YES\"),'Order Form'!$E$12,\"\")","v":0},{"$f":"'Order Form'!$E$13 & \"\"","v":""},{"$f":"IF('Order Form'!D162=\"\",'Order Form'!C162,'Order Form'!D162) & \"\"","v":""},{"$f":"'Order Form'!E162 & \"\"","v":""},{"$f":"'Order Form'!F162","v":0},{"$f":"'Order Form'!I162","v":0},{"$f":"'Order Form'!G162","v":0},{"$f":"'Order Form'!H162","v":0},{"$f":"'Order Form'!J162 & \"\"","v":""},{"$f":"'Order Form'!L162 & \"\"","v":""},{"$f":"'Order Form'!C162 & \"\"","v":""},{"$f":"'Order Form'!K162 & \"\"","v":""},{"$f":"'Order Form'!$E$14","v":"YES"},{"$f":"'Order Form'!$E$19","v":0},{"$f":"'Order Form'!$E$16","v":"FREE gift card"},{"$f":"'Order Form'!$E$17","v":"No thanks"},"No","No",{"$f":"\"Dispatch Week: \"&'Order Form'!$E$18","v":"Dispatch Week: "},{"$f":"\"VIP: \"&'Order Form'!$E$5 &\"; Rib: \"&'Order Form'!$E$17 &\"; GT: \"&'Order Form'!$E$16","v":"VIP: ; Rib: No thanks; GT: FREE gift card"},null,null,null,{"$f":"IF(P142=\"\",\"\",IFERROR(INDIRECT(\"Postcodes!$C\"&SUMPRODUCT(--(Postcodes!$A$2:$A$100<=P142)*(Postcodes!$B$2:$B$100>=P142), ROW(Postcodes!$A$2:$A$100))),\"WRONG CODE\"))","v":0},null,null,null,null,null,null,""]
[{"$f":"'Order Form'!A163","v":142},{"$f":"'Order Form'!M163","v":""},{"$f":"'Order Form'!$E$4","v":0},{"$f":"'Order Form'!$E$5","v":0},{"$f":"'Order Form'!$E$6","v":0},{"$f":"'Order Form'!$E$7","v":0},{"$f":"'Order Form'!$E$9","v":0},{"$f":"'Order Form'!$E$8","v":0},{"$f":"'Order Form'!$E$10","v":0},{"$f":"'Order Form'!$E$11","v":0},{"$f":"IF(('Order Form'!$E$15=\"YES\"),'Order Form'!$E$12,\"\")","v":0},{"$f":"'Order Form'!$E$13 & \"\"","v":""},{"$f":"IF('Order Form'!D163=\"\",'Order Form'!C163,'Order Form'!D163) & \"\"","v":""},{"$f":"'Order Form'!E163 & \"\"","v":""},{"$f":"'Order Form'!F163","v":0},{"$f":"'Order Form'!I163","v":0},{"$f":"'Order Form'!G163","v":0},{"$f":"'Order Form'!H163","v":0},{"$f":"'Order Form'!J163 & \"\"","v":""},{"$f":"'Order Form'!L163 & \"\"","v":""},{"$f":"'Order Form'!C163 & \"\"","v":""},{"$f":"'Order Form'!K163 & \"\"","v":""},{"$f":"'Order Form'!$E$14","v":"YES"},{"$f":"'Order Form'!$E$19","v":0},{"$f":"'Order Form'!$E$16","v":"FREE gift card"},{"$f":"'Order Form'!$E$17","v":"No thanks"},"No","No",{"$f":"\"Dispatch Week: \"&'Order Form'!$E$18","v":"Dispatch Week: "},{"$f":"\"VIP: \"&'Order Form'!$E$5 &\"; Rib: \"&'Order Form'!$E$17 &\"; GT: \"&'Order Form'!$E$16","v":"VIP: ; Rib: No thanks; GT: FREE gift card"},null,null,null,{"$f":"IF(P143=\"\",\"\",IFERROR(INDIRECT(\"Postcodes!$C\"&SUMPRODUCT(--(Postcodes!$A$2:$A$100<=P143)*(Postcodes!$B$2:$B$100>=P143), ROW(Postcodes!$A$2:$A$100))),\"WRONG CODE\"))","v":0},null,null,null,null,null,null,""]
[{"$f":"'Order Form'!A164","v":143},{"$f":"'Order Form'!M164","v":""},{"$f":"'Order Form'!$E$4","v":0},{"$f":"'Order Form'!$E$5","v":0},{"$f":"'Order Form'!$E$6","v":0},{"$f":"'Order Form'!$E$7","v":0},{"$f":"'Order Form'!$E$9","v":0},{"$f":"'Order Form'!$E$8","v":0},{"$f":"'Order Form'!$E$10","v":0},{"$f":"'Order Form'!$E$11","v":0},{"$f":"IF(('Order Form'!$E$15=\"YES\"),'Order Form'!$E$12,\"\")","v":0},{"$f":"'Order Form'!$E$13 & \"\"","v":""},{"$f":"IF('Order Form'!D164=\"\",'Order Form'!C164,'Order Form'!D164) & \"\"","v":""},{"$f":"'Order Form'!E164 & \"\"","v":""},{"$f":"'Order Form'!F164","v":0},{"$f":"'Order Form'!I164","v":0},{"$f":"'Order Form'!G164","v":0},{"$f":"'Order Form'!H164","v":0},{"$f":"'Order Form'!J164 & \"\"","v":""},{"$f":"'Order Form'!L164 & \"\"","v":""},{"$f":"'Order Form'!C164 & \"\"","v":""},{"$f":"'Order Form'!K164 & \"\"","v":""},{"$f":"'Order Form'!$E$14","v":"YES"},{"$f":"'Order Form'!$E$19","v":0},{"$f":"'Order Form'!$E$16","v":"FREE gift card"},{"$f":"'Order Form'!$E$17","v":"No thanks"},"No","No",{"$f":"\"Dispatch Week: \"&'Order Form'!$E$18","v":"Dispatch Week: "},{"$f":"\"VIP: \"&'Order Form'!$E$5 &\"; Rib: \"&'Order Form'!$E$17 &\"; GT: \"&'Order Form'!$E$16","v":"VIP: ; Rib: No thanks; GT: FREE gift card"},null,null,null,{"$f":"IF(P144=\"\",\"\",IFERROR(INDIRECT(\"Postcodes!$C\"&SUMPRODUCT(--(Postcodes!$A$2:$A$100<=P144)*(Postcodes!$B$2:$B$100>=P144), ROW(Postcodes!$A$2:$A$100))),\"WRONG CODE\"))","v":0},null,null,null,null,null,null,""]
[{"$f":"'Order Form'!A165","v":144},{"$f":"'Order Form'!M165","v":""},{"$f":"'Order Form'!$E$4","v":0},{"$f":"'Order Form'!$E$5","v":0},{"$f":"'Order Form'!$E$6","v":0},{"$f":"'Order Form'!$E$7","v":0},{"$f":"'Order Form'!$E$9","v":0},{"$f":"'Order Form'!$E$8","v":0},{"$f":"'Order Form'!$E$10","v":0},{"$f":"'Order Form'!$E$11","v":0},{"$f":"IF(('Order Form'!$E$15=\"YES\"),'Order Form'!$E$12,\"\")","v":0},{"$f":"'Order Form'!$E$13 & \"\"","v":""},{"$f":"IF('Order Form'!D165=\"\",'Order Form'!C165,'Order Form'!D165) & \"\"","v":""},{"$f":"'Order Form'!E165 & \"\"","v":""},{"$f":"'Order Form'!F165","v":0},{"$f":"'Order Form'!I165","v":0},{"$f":"'Order Form'!G165","v":0},{"$f":"'Order Form'!H165","v":0},{"$f":"'Order Form'!J165 & \"\"","v":""},{"$f":"'Order Form'!L165 & \"\"","v":""},{"$f":"'Order Form'!C165 & \"\"","v":""},{"$f":"'Order Form'!K165 & \"\"","v":""},{"$f":"'Order Form'!$E$14","v":"YES"},{"$f":"'Order Form'!$E$19","v":0},{"$f":"'Order Form'!$E$16","v":"FREE gift card"},{"$f":"'Order Form'!$E$17","v":"No thanks"},"No","No",{"$f":"\"Dispatch Week: \"&'Order Form'!$E$18","v":"Dispatch Week: "},{"$f":"\"VIP: \"&'Order Form'!$E$5 &\"; Rib: \"&'Order Form'!$E$17 &\"; GT: \"&'Order Form'!$E$16","v":"VIP: ; Rib: No thanks; GT: FREE gift card"},null,null,null,{"$f":"IF(P145=\"\",\"\",IFERROR(INDIRECT(\"Postcodes!$C\"&SUMPRODUCT(--(Postcodes!$A$2:$A$100<=P145)*(Postcodes!$B$2:$B$100>=P145), ROW(Postcodes!$A$2:$A$100))),\"WRONG CODE\"))","v":0},null,null,null,null,null,null,""]
[{"$f":"'Order Form'!A166","v":145},{"$f":"'Order Form'!M166","v":""},{"$f":"'Order Form'!$E$4","v":0},{"$f":"'Order Form'!$E$5","v":0},{"$f":"'Order Form'!$E$6","v":0},{"$f":"'Order Form'!$E$7","v":0},{"$f":"'Order Form'!$E$9","v":0},{"$f":"'Order Form'!$E$8","v":0},{"$f":"'Order Form'!$E$10","v":0},{"$f":"'Order Form'!$E$11","v":0},{"$f":"IF(('Order Form'!$E$15=\"YES\"),'Order Form'!$E$12,\"\")","v":0},{"$f":"'Order Form'!$E$13 & \"\"","v":""},{"$f":"IF('Order Form'!D166=\"\",'Order Form'!C166,'Order Form'!D166) & \"\"","v":""},{"$f":"'Order Form'!E166 & \"\"","v":""},{"$f":"'Order Form'!F166","v":0},{"$f":"'Order Form'!I166","v":0},{"$f":"'Order Form'!G166","v":0},{"$f":"'Order Form'!H166","v":0},{"$f":"'Order Form'!J166 & \"\"","v":""},{"$f":"'Order Form'!L166 & \"\"","v":""},{"$f":"'Order Form'!C166 & \"\"","v":""},{"$f":"'Order Form'!K166 & \"\"","v":""},{"$f":"'Order Form'!$E$14","v":"YES"},{"$f":"'Order Form'!$E$19","v":0},{"$f":"'Order Form'!$E$16","v":"FREE gift card"},{"$f":"'Order Form'!$E$17","v":"No thanks"},"No","No",{"$f":"\"Dispatch Week: \"&'Order Form'!$E$18","v":"Dispatch Week: "},{"$f":"\"VIP: \"&'Order Form'!$E$5 &\"; Rib: \"&'Order Form'!$E$17 &\"; GT: \"&'Order Form'!$E$16","v":"VIP: ; Rib: No thanks; GT: FREE gift card"},null,null,null,{"$f":"IF(P146=\"\",\"\",IFERROR(INDIRECT(\"Postcodes!$C\"&SUMPRODUCT(--(Postcodes!$A$2:$A$100<=P146)*(Postcodes!$B$2:$B$100>=P146), ROW(Postcodes!$A$2:$A$100))),\"WRONG CODE\"))","v":0},null,null,null,null,null,null,""]
[{"$f":"'Order Form'!A167","v":146},{"$f":"'Order Form'!M167","v":""},{"$f":"'Order Form'!$E$4","v":0},{"$f":"'Order Form'!$E$5","v":0},{"$f":"'Order Form'!$E$6","v":0},{"$f":"'Order Form'!$E$7","v":0},{"$f":"'Order Form'!$E$9","v":0},{"$f":"'Order Form'!$E$8","v":0},{"$f":"'Order Form'!$E$10","v":0},{"$f":"'Order Form'!$E$11","v":0},{"$f":"IF(('Order Form'!$E$15=\"YES\"),'Order Form'!$E$12,\"\")","v":0},{"$f":"'Order Form'!$E$13 & \"\"","v":""},{"$f":"IF('Order Form'!D167=\"\",'Order Form'!C167,'Order Form'!D167) & \"\"","v":""},{"$f":"'Order Form'!E167 & \"\"","v":""},{"$f":"'Order Form'!F167","v":0},{"$f":"'Order Form'!I167","v":0},{"$f":"'Order Form'!G167","v":0},{"$f":"'Order Form'!H167","v":0},{"$f":"'Order Form'!J167 & \"\"","v":""},{"$f":"'Order Form'!L167 & \"\"","v":""},{"$f":"'Order Form'!C167 & \"\"","v":""},{"$f":"'Order Form'!K167 & \"\"","v":""},{"$f":"'Order Form'!$E$14","v":"YES"},{"$f":"'Order Form'!$E$19","v":0},{"$f":"'Order Form'!$E$16","v":"FREE gift card"},{"$f":"'Order Form'!$E$17","v":"No thanks"},"No","No",{"$f":"\"Dispatch Week: \"&'Order Form'!$E$18","v":"Dispatch Week: "},{"$f":"\"VIP: \"&'Order Form'!$E$5 &\"; Rib: \"&'Order Form'!$E$17 &\"; GT: \"&'Order Form'!$E$16","v":"VIP: ; Rib: No thanks; GT: FREE gift card"},null,null,null,{"$f":"IF(P147=\"\",\"\",IFERROR(INDIRECT(\"Postcodes!$C\"&SUMPRODUCT(--(Postcodes!$A$2:$A$100<=P147)*(Postcodes!$B$2:$B$100>=P147), ROW(Postcodes!$A$2:$A$100))),\"WRONG CODE\"))","v":0},null,null,null,null,null,null,""]
[{"$f":"'Order Form'!A168","v":147},{"$f":"'Order Form'!M168","v":""},{"$f":"'Order Form'!$E$4","v":0},{"$f":"'Order Form'!$E$5","v":0},{"$f":"'Order Form'!$E$6","v":0},{"$f":"'Order Form'!$E$7","v":0},{"$f":"'Order Form'!$E$9","v":0},{"$f":"'Order Form'!$E$8","v":0},{"$f":"'Order Form'!$E$10","v":0},{"$f":"'Order Form'!$E$11","v":0},{"$f":"IF(('Order Form'!$E$15=\"YES\"),'Order Form'!$E$12,\"\")","v":0},{"$f":"'Order Form'!$E$13 & \"\"","v":""},{"$f":"IF('Order Form'!D168=\"\",'Order Form'!C168,'Order Form'!D168) & \"\"","v":""},{"$f":"'Order Form'!E168 & \"\"","v":""},{"$f":"'Order Form'!F168","v":0},{"$f":"'Order Form'!I168","v":0},{"$f":"'Order Form'!G168","v":0},{"$f":"'Order Form'!H168","v":0},{"$f":"'Order Form'!J168 & \"\"","v":""},{"$f":"'Order Form'!L168 & \"\"","v":""},{"$f":"'Order Form'!C168 & \"\"","v":""},{"$f":"'Order Form'!K168 & \"\"","v":""},{"$f":"'Order Form'!$E$14","v":"YES"},{"$f":"'Order Form'!$E$19","v":0},{"$f":"'Order Form'!$E$16","v":"FREE gift card"},{"$f":"'Order Form'!$E$17","v":"No thanks"},"No","No",{"$f":"\"Dispatch Week: \"&'Order Form'!$E$18","v":"Dispatch Week: "},{"$f":"\"VIP: \"&'Order Form'!$E$5 &\"; Rib: \"&'Order Form'!$E$17 &\"; GT: \"&'Order Form'!$E$16","v":"VIP: ; Rib: No thanks; GT: FREE gift card"},null,null,null,{"$f":"IF(P148=\"\",\"\",IFERROR(INDIRECT(\"Postcodes!$C\"&SUMPRODUCT(--(Postcodes!$A$2:$A$100<=P148)*(Postcodes!$B$2:$B$100>=P148), ROW(Postcodes!$A$2:$A$100))),\"WRONG CODE\"))","v":0},null,null,null,null,null,null,""]
[{"$f":"'Order Form'!A169","v":148},{"$f":"'Order Form'!M169","v":""},{"$f":"'Order Form'!$E$4","v":0},{"$f":"'Order Form'!$E$5","v":0},{"$f":"'Order Form'!$E$6","v":0},{"$f":"'Order Form'!$E$7","v":0},{"$f":"'Order Form'!$E$9","v":0},{"$f":"'Order Form'!$E$8","v":0},{"$f":"'Order Form'!$E$10","v":0},{"$f":"'Order Form'!$E$11","v":0},{"$f":"IF(('Order Form'!$E$15=\"YES\"),'Order Form'!$E$12,\"\")","v":0},{"$f":"'Order Form'!$E$13 & \"\"","v":""},{"$f":"IF('Order Form'!D169=\"\",'Order Form'!C169,'Order Form'!D169) & \"\"","v":""},{"$f":"'Order Form'!E169 & \"\"","v":""},{"$f":"'Order Form'!F169","v":0},{"$f":"'Order Form'!I169","v":0},{"$f":"'Order Form'!G169","v":0},{"$f":"'Order Form'!H169","v":0},{"$f":"'Order Form'!J169 & \"\"","v":""},{"$f":"'Order Form'!L169 & \"\"","v":""},{"$f":"'Order Form'!C169 & \"\"","v":""},{"$f":"'Order Form'!K169 & \"\"","v":""},{"$f":"'Order Form'!$E$14","v":"YES"},{"$f":"'Order Form'!$E$19","v":0},{"$f":"'Order Form'!$E$16","v":"FREE gift card"},{"$f":"'Order Form'!$E$17","v":"No thanks"},"No","No",{"$f":"\"Dispatch Week: \"&'Order Form'!$E$18","v":"Dispatch Week: "},{"$f":"\"VIP: \"&'Order Form'!$E$5 &\"; Rib: \"&'Order Form'!$E$17 &\"; GT: \"&'Order Form'!$E$16","v":"VIP: ; Rib: No thanks; GT: FREE gift card"},null,null,null,{"$f":"IF(P149=\"\",\"\",IFERROR(INDIRECT(\"Postcodes!$C\"&SUMPRODUCT(--(Postcodes!$A$2:$A$100<=P149)*(Postcodes!$B$2:$B$100>=P149), ROW(Postcodes!$A$2:$A$100))),\"WRONG CODE\"))","v":0},null,null,null,null,null,null,""]
[{"$f":"'Order Form'!A170","v":149},{"$f":"'Order Form'!M170","v":""},{"$f":"'Order Form'!$E$4","v":0},{"$f":"'Order Form'!$E$5","v":0},{"$f":"'Order Form'!$E$6","v":0},{"$f":"'Order Form'!$E$7","v":0},{"$f":"'Order Form'!$E$9","v":0},{"$f":"'Order Form'!$E$8","v":0},{"$f":"'Order Form'!$E$10","v":0},{"$f":"'Order Form'!$E$11","v":0},{"$f":"IF(('Order Form'!$E$15=\"YES\"),'Order Form'!$E$12,\"\")","v":0},{"$f":"'Order Form'!$E$13 & \"\"","v":""},{"$f":"IF('Order Form'!D170=\"\",'Order Form'!C170,'Order Form'!D170) & \"\"","v":""},{"$f":"'Order Form'!E170 & \"\"","v":""},{"$f":"'Order Form'!F170","v":0},{"$f":"'Order Form'!I170","v":0},{"$f":"'Order Form'!G170","v":0},{"$f":"'Order Form'!H170","v":0},{"$f":"'Order Form'!J170 & \"\"","v":""},{"$f":"'Order Form'!L170 & \"\"","v":""},{"$f":"'Order Form'!C170 & \"\"","v":""},{"$f":"'Order Form'!K170 & \"\"","v":""},{"$f":"'Order Form'!$E$14","v":"YES"},{"$f":"'Order Form'!$E$19","v":0},{"$f":"'Order Form'!$E$16","v":"FREE gift card"},{"$f":"'Order Form'!$E$17","v":"No thanks"},"No","No",{"$f":"\"Dispatch Week: \"&'Order Form'!$E$18","v":"Dispatch Week: "},{"$f":"\"VIP: \"&'Order Form'!$E$5 &\"; Rib: \"&'Order Form'!$E$17 &\"; GT: \"&'Order Form'!$E$16","v":"VIP: ; Rib: No thanks; GT: FREE gift card"},null,null,null,{"$f":"IF(P150=\"\",\"\",IFERROR(INDIRECT(\"Postcodes!$C\"&SUMPRODUCT(--(Postcodes!$A$2:$A$100<=P150)*(Postcodes!$B$2:$B$100>=P150), ROW(Postcodes!$A$2:$A$100))),\"WRONG CODE\"))","v":0},null,null,null,null,null,null,""]
[{"$f":"'Order Form'!A171","v":150},{"$f":"'Order Form'!M171","v":""},{"$f":"'Order Form'!$E$4","v":0},{"$f":"'Order Form'!$E$5","v":0},{"$f":"'Order Form'!$E$6","v":0},{"$f":"'Order Form'!$E$7","v":0},{"$f":"'Order Form'!$E$9","v":0},{"$f":"'Order Form'!$E$8","v":0},{"$f":"'Order Form'!$E$10","v":0},{"$f":"'Order Form'!$E$11","v":0},{"$f":"IF(('Order Form'!$E$15=\"YES\"),'Order Form'!$E$12,\"\")","v":0},{"$f":"'Order Form'!$E$13 & \"\"","v":""},{"$f":"IF('Order Form'!D171=\"\",'Order Form'!C171,'Order Form'!D171) & \"\"","v":""},{"$f":"'Order Form'!E171 & \"\"","v":""},{"$f":"'Order Form'!F171","v":0},{"$f":"'Order Form'!I171","v":0},{"$f":"'Order Form'!G171","v":0},{"$f":"'Order Form'!H171","v":0},{"$f":"'Order Form'!J171 & \"\"","v":""},{"$f":"'Order Form'!L171 & \"\"","v":""},{"$f":"'Order Form'!C171 & \"\"","v":""},{"$f":"'Order Form'!K171 & \"\"","v":""},{"$f":"'Order Form'!$E$14","v":"YES"},{"$f":"'Order Form'!$E$19","v":0},{"$f":"'Order Form'!$E$16","v":"FREE gift card"},{"$f":"'Order Form'!$E$17","v":"No thanks"},"No","No",{"$f":"\"Dispatch Week: \"&'Order Form'!$E$18","v":"Dispatch Week: "},{"$f":"\"VIP: \"&'Order Form'!$E$5 &\"; Rib: \"&'Order Form'!$E$17 &\"; GT: \"&'Order Form'!$E$16","v":"VIP: ; Rib: No thanks; GT: FREE gift card"},null,null,null,{"$f":"IF(P151=\"\",\"\",IFERROR(INDIRECT(\"Postcodes!$C\"&SUMPRODUCT(--(Postcodes!$A$2:$A$100<=P151)*(Postcodes!$B$2:$B$100>=P151), ROW(Postcodes!$A$2:$A$100))),\"WRONG CODE\"))","v":0},null,null,null,null,null,null,""]
[{"$f":"'Order Form'!A172","v":151},{"$f":"'Order Form'!M172","v":""},{"$f":"'Order Form'!$E$4","v":0},{"$f":"'Order Form'!$E$5","v":0},{"$f":"'Order Form'!$E$6","v":0},{"$f":"'Order Form'!$E$7","v":0},{"$f":"'Order Form'!$E$9","v":0},{"$f":"'Order Form'!$E$8","v":0},{"$f":"'Order Form'!$E$10","v":0},{"$f":"'Order Form'!$E$11","v":0},{"$f":"IF(('Order Form'!$E$15=\"YES\"),'Order Form'!$E$12,\"\")","v":0},{"$f":"'Order Form'!$E$13 & \"\"","v":""},{"$f":"IF('Order Form'!D172=\"\",'Order Form'!C172,'Order Form'!D172) & \"\"","v":""},{"$f":"'Order Form'!E172 & \"\"","v":""},{"$f":"'Order Form'!F172","v":0},{"$f":"'Order Form'!I172","v":0},{"$f":"'Order Form'!G172","v":0},{"$f":"'Order Form'!H172","v":0},{"$f":"'Order Form'!J172 & \"\"","v":""},{"$f":"'Order Form'!L172 & \"\"","v":""},{"$f":"'Order Form'!C172 & \"\"","v":""},{"$f":"'Order Form'!K172 & \"\"","v":""},{"$f":"'Order Form'!$E$14","v":"YES"},{"$f":"'Order Form'!$E$19","v":0},{"$f":"'Order Form'!$E$16","v":"FREE gift card"},{"$f":"'Order Form'!$E$17","v":"No thanks"},"No","No",{"$f":"\"Dispatch Week: \"&'Order Form'!$E$18","v":"Dispatch Week: "},{"$f":"\"VIP: \"&'Order Form'!$E$5 &\"; Rib: \"&'Order Form'!$E$17 &\"; GT: \"&'Order Form'!$E$16","v":"VIP: ; Rib: No thanks; GT: FREE gift card"},null,null,null,{"$f":"IF(P152=\"\",\"\",IFERROR(INDIRECT(\"Postcodes!$C\"&SUMPRODUCT(--(Postcodes!$A$2:$A$100<=P152)*(Postcodes!$B$2:$B$100>=P152), ROW(Postcodes!$A$2:$A$100))),\"WRONG CODE\"))","v":0},null,null,null,null,null,null,""]
[{"$f":"'Order Form'!A173","v":152},{"$f":"'Order Form'!M173","v":""},{"$f":"'Order Form'!$E$4","v":0},{"$f":"'Order Form'!$E$5","v":0},{"$f":"'Order Form'!$E$6","v":0},{"$f":"'Order Form'!$E$7","v":0},{"$f":"'Order Form'!$E$9","v":0},{"$f":"'Order Form'!$E$8","v":0},{"$f":"'Order Form'!$E$10","v":0},{"$f":"'Order Form'!$E$11","v":0},{"$f":"IF(('Order Form'!$E$15=\"YES\"),'Order Form'!$E$12,\"\")","v":0},{"$f":"'Order Form'!$E$13 & \"\"","v":""},{"$f":"IF('Order Form'!D173=\"\",'Order Form'!C173,'Order Form'!D173) & \"\"","v":""},{"$f":"'Order Form'!E173 & \"\"","v":""},{"$f":"'Order Form'!F173","v":0},{"$f":"'Order Form'!I173","v":0},{"$f":"'Order Form'!G173","v":0},{"$f":"'Order Form'!H173","v":0},{"$f":"'Order Form'!J173 & \"\"","v":""},{"$f":"'Order Form'!L173 & \"\"","v":""},{"$f":"'Order Form'!C173 & \"\"","v":""},{"$f":"'Order Form'!K173 & \"\"","v":""},{"$f":"'Order Form'!$E$14","v":"YES"},{"$f":"'Order Form'!$E$19","v":0},{"$f":"'Order Form'!$E$16","v":"FREE gift card"},{"$f":"'Order Form'!$E$17","v":"No thanks"},"No","No",{"$f":"\"Dispatch Week: \"&'Order Form'!$E$18","v":"Dispatch Week: "},{"$f":"\"VIP: \"&'Order Form'!$E$5 &\"; Rib: \"&'Order Form'!$E$17 &\"; GT: \"&'Order Form'!$E$16","v":"VIP: ; Rib: No thanks; GT: FREE gift card"},null,null,null,{"$f":"IF(P153=\"\",\"\",IFERROR(INDIRECT(\"Postcodes!$C\"&SUMPRODUCT(--(Postcodes!$A$2:$A$100<=P153)*(Postcodes!$B$2:$B$100>=P153), ROW(Postcodes!$A$2:$A$100))),\"WRONG CODE\"))","v":0},null,null,null,null,null,null,""]
[{"$f":"'Order Form'!A174","v":153},{"$f":"'Order Form'!M174","v":""},{"$f":"'Order Form'!$E$4","v":0},{"$f":"'Order Form'!$E$5","v":0},{"$f":"'Order Form'!$E$6","v":0},{"$f":"'Order Form'!$E$7","v":0},{"$f":"'Order Form'!$E$9","v":0},{"$f":"'Order Form'!$E$8","v":0},{"$f":"'Order Form'!$E$10","v":0},{"$f":"'Order Form'!$E$11","v":0},{"$f":"IF(('Order Form'!$E$15=\"YES\"),'Order Form'!$E$12,\"\")","v":0},{"$f":"'Order Form'!$E$13 & \"\"","v":""},{"$f":"IF('Order Form'!D174=\"\",'Order Form'!C174,'Order Form'!D174) & \"\"","v":""},{"$f":"'Order Form'!E174 & \"\"","v":""},{"$f":"'Order Form'!F174","v":0},{"$f":"'Order Form'!I174","v":0},{"$f":"'Order Form'!G174","v":0},{"$f":"'Order Form'!H174","v":0},{"$f":"'Order Form'!J174 & \"\"","v":""},{"$f":"'Order Form'!L174 & \"\"","v":""},{"$f":"'Order Form'!C174 & \"\"","v":""},{"$f":"'Order Form'!K174 & \"\"","v":""},{"$f":"'Order Form'!$E$14","v":"YES"},{"$f":"'Order Form'!$E$19","v":0},{"$f":"'Order Form'!$E$16","v":"FREE gift card"},{"$f":"'Order Form'!$E$17","v":"No thanks"},"No","No",{"$f":"\"Dispatch Week: \"&'Order Form'!$E$18","v":"Dispatch Week: "},{"$f":"\"VIP: \"&'Order Form'!$E$5 &\"; Rib: \"&'Order Form'!$E$17 &\"; GT: \"&'Order Form'!$E$16","v":"VIP: ; Rib: No thanks; GT: FREE gift card"},null,null,null,{"$f":"IF(P154=\"\",\"\",IFERROR(INDIRECT(\"Postcodes!$C\"&SUMPRODUCT(--(Postcodes!$A$2:$A$100<=P154)*(Postcodes!$B$2:$B$100>=P154), ROW(Postcodes!$A$2:$A$100))),\"WRONG CODE\"))","v":0},null,null,null,null,null,null,""]
[{"$f":"'Order Form'!A175","v":154},{"$f":"'Order Form'!M175","v":""},{"$f":"'Order Form'!$E$4","v":0},{"$f":"'Order Form'!$E$5","v":0},{"$f":"'Order Form'!$E$6","v":0},{"$f":"'Order Form'!$E$7","v":0},{"$f":"'Order Form'!$E$9","v":0},{"$f":"'Order Form'!$E$8","v":0},{"$f":"'Order Form'!$E$10","v":0},{"$f":"'Order Form'!$E$11","v":0},{"$f":"IF(('Order Form'!$E$15=\"YES\"),'Order Form'!$E$12,\"\")","v":0},{"$f":"'Order Form'!$E$13 & \"\"","v":""},{"$f":"IF('Order Form'!D175=\"\",'Order Form'!C175,'Order Form'!D175) & \"\"","v":""},{"$f":"'Order Form'!E175 & \"\"","v":""},{"$f":"'Order Form'!F175","v":0},{"$f":"'Order Form'!I175","v":0},{"$f":"'Order Form'!G175","v":0},{"$f":"'Order Form'!H175","v":0},{"$f":"'Order Form'!J175 & \"\"","v":""},{"$f":"'Order Form'!L175 & \"\"","v":""},{"$f":"'Order Form'!C175 & \"\"","v":""},{"$f":"'Order Form'!K175 & \"\"","v":""},{"$f":"'Order Form'!$E$14","v":"YES"},{"$f":"'Order Form'!$E$19","v":0},{"$f":"'Order Form'!$E$16","v":"FREE gift card"},{"$f":"'Order Form'!$E$17","v":"No thanks"},"No","No",{"$f":"\"Dispatch Week: \"&'Order Form'!$E$18","v":"Dispatch Week: "},{"$f":"\"VIP: \"&'Order Form'!$E$5 &\"; Rib: \"&'Order Form'!$E$17 &\"; GT: \"&'Order Form'!$E$16","v":"VIP: ; Rib: No thanks; GT: FREE gift card"},null,null,null,{"$f":"IF(P155=\"\",\"\",IFERROR(INDIRECT(\"Postcodes!$C\"&SUMPRODUCT(--(Postcodes!$A$2:$A$100<=P155)*(Postcodes!$B$2:$B$100>=P155), ROW(Postcodes!$A$2:$A$100))),\"WRONG CODE\"))","v":0},null,null,null,null,null,null,""]
[{"$f":"'Order Form'!A176","v":155},{"$f":"'Order Form'!M176","v":""},{"$f":"'Order Form'!$E$4","v":0},{"$f":"'Order Form'!$E$5","v":0},{"$f":"'Order Form'!$E$6","v":0},{"$f":"'Order Form'!$E$7","v":0},{"$f":"'Order Form'!$E$9","v":0},{"$f":"'Order Form'!$E$8","v":0},{"$f":"'Order Form'!$E$10","v":0},{"$f":"'Order Form'!$E$11","v":0},{"$f":"IF(('Order Form'!$E$15=\"YES\"),'Order Form'!$E$12,\"\")","v":0},{"$f":"'Order Form'!$E$13 & \"\"","v":""},{"$f":"IF('Order Form'!D176=\"\",'Order Form'!C176,'Order Form'!D176) & \"\"","v":""},{"$f":"'Order Form'!E176 & \"\"","v":""},{"$f":"'Order Form'!F176","v":0},{"$f":"'Order Form'!I176","v":0},{"$f":"'Order Form'!G176","v":0},{"$f":"'Order Form'!H176","v":0},{"$f":"'Order Form'!J176 & \"\"","v":""},{"$f":"'Order Form'!L176 & \"\"","v":""},{"$f":"'Order Form'!C176 & \"\"","v":""},{"$f":"'Order Form'!K176 & \"\"","v":""},{"$f":"'Order Form'!$E$14","v":"YES"},{"$f":"'Order Form'!$E$19","v":0},{"$f":"'Order Form'!$E$16","v":"FREE gift card"},{"$f":"'Order Form'!$E$17","v":"No thanks"},"No","No",{"$f":"\"Dispatch Week: \"&'Order Form'!$E$18","v":"Dispatch Week: "},{"$f":"\"VIP: \"&'Order Form'!$E$5 &\"; Rib: \"&'Order Form'!$E$17 &\"; GT: \"&'Order Form'!$E$16","v":"VIP: ; Rib: No thanks; GT: FREE gift card"},null,null,null,{"$f":"IF(P156=\"\",\"\",IFERROR(INDIRECT(\"Postcodes!$C\"&SUMPRODUCT(--(Postcodes!$A$2:$A$100<=P156)*(Postcodes!$B$2:$B$100>=P156), ROW(Postcodes!$A$2:$A$100))),\"WRONG CODE\"))","v":0},null,null,null,null,null,null,""]
[{"$f":"'Order Form'!A177","v":156},{"$f":"'Order Form'!M177","v":""},{"$f":"'Order Form'!$E$4","v":0},{"$f":"'Order Form'!$E$5","v":0},{"$f":"'Order Form'!$E$6","v":0},{"$f":"'Order Form'!$E$7","v":0},{"$f":"'Order Form'!$E$9","v":0},{"$f":"'Order Form'!$E$8","v":0},{"$f":"'Order Form'!$E$10","v":0},{"$f":"'Order Form'!$E$11","v":0},{"$f":"IF(('Order Form'!$E$15=\"YES\"),'Order Form'!$E$12,\"\")","v":0},{"$f":"'Order Form'!$E$13 & \"\"","v":""},{"$f":"IF('Order Form'!D177=\"\",'Order Form'!C177,'Order Form'!D177) & \"\"","v":""},{"$f":"'Order Form'!E177 & \"\"","v":""},{"$f":"'Order Form'!F177","v":0},{"$f":"'Order Form'!I177","v":0},{"$f":"'Order Form'!G177","v":0},{"$f":"'Order Form'!H177","v":0},{"$f":"'Order Form'!J177 & \"\"","v":""},{"$f":"'Order Form'!L177 & \"\"","v":""},{"$f":"'Order Form'!C177 & \"\"","v":""},{"$f":"'Order Form'!K177 & \"\"","v":""},{"$f":"'Order Form'!$E$14","v":"YES"},{"$f":"'Order Form'!$E$19","v":0},{"$f":"'Order Form'!$E$16","v":"FREE gift card"},{"$f":"'Order Form'!$E$17","v":"No thanks"},"No","No",{"$f":"\"Dispatch Week: \"&'Order Form'!$E$18","v":"Dispatch Week: "},{"$f":"\"VIP: \"&'Order Form'!$E$5 &\"; Rib: \"&'Order Form'!$E$17 &\"; GT: \"&'Order Form'!$E$16","v":"VIP: ; Rib: No thanks; GT: FREE gift card"},null,null,null,{"$f":"IF(P157=\"\",\"\",IFERROR(INDIRECT(\"Postcodes!$C\"&SUMPRODUCT(--(Postcodes!$A$2:$A$100<=P157)*(Postcodes!$B$2:$B$100>=P157), ROW(Postcodes!$A$2:$A$100))),\"WRONG CODE\"))","v":0},null,null,null,null,null,null,""]
[{"$f":"'Order Form'!A178","v":157},{"$f":"'Order Form'!M178","v":""},{"$f":"'Order Form'!$E$4","v":0},{"$f":"'Order Form'!$E$5","v":0},{"$f":"'Order Form'!$E$6","v":0},{"$f":"'Order Form'!$E$7","v":0},{"$f":"'Order Form'!$E$9","v":0},{"$f":"'Order Form'!$E$8","v":0},{"$f":"'Order Form'!$E$10","v":0},{"$f":"'Order Form'!$E$11","v":0},{"$f":"IF(('Order Form'!$E$15=\"YES\"),'Order Form'!$E$12,\"\")","v":0},{"$f":"'Order Form'!$E$13 & \"\"","v":""},{"$f":"IF('Order Form'!D178=\"\",'Order Form'!C178,'Order Form'!D178) & \"\"","v":""},{"$f":"'Order Form'!E178 & \"\"","v":""},{"$f":"'Order Form'!F178","v":0},{"$f":"'Order Form'!I178","v":0},{"$f":"'Order Form'!G178","v":0},{"$f":"'Order Form'!H178","v":0},{"$f":"'Order Form'!J178 & \"\"","v":""},{"$f":"'Order Form'!L178 & \"\"","v":""},{"$f":"'Order Form'!C178 & \"\"","v":""},{"$f":"'Order Form'!K178 & \"\"","v":""},{"$f":"'Order Form'!$E$14","v":"YES"},{"$f":"'Order Form'!$E$19","v":0},{"$f":"'Order Form'!$E$16","v":"FREE gift card"},{"$f":"'Order Form'!$E$17","v":"No thanks"},"No","No",{"$f":"\"Dispatch Week: \"&'Order Form'!$E$18","v":"Dispatch Week: "},{"$f":"\"VIP: \"&'Order Form'!$E$5 &\"; Rib: \"&'Order Form'!$E$17 &\"; GT: \"&'Order Form'!$E$16","v":"VIP: ; Rib: No thanks; GT: FREE gift card"},null,null,null,{"$f":"IF(P158=\"\",\"\",IFERROR(INDIRECT(\"Postcodes!$C\"&SUMPRODUCT(--(Postcodes!$A$2:$A$100<=P158)*(Postcodes!$B$2:$B$100>=P158), ROW(Postcodes!$A$2:$A$100))),\"WRONG CODE\"))","v":0},null,null,null,null,null,null,""]
[{"$f":"'Order Form'!A179","v":158},{"$f":"'Order Form'!M179","v":""},{"$f":"'Order Form'!$E$4","v":0},{"$f":"'Order Form'!$E$5","v":0},{"$f":"'Order Form'!$E$6","v":0},{"$f":"'Order Form'!$E$7","v":0},{"$f":"'Order Form'!$E$9","v":0},{"$f":"'Order Form'!$E$8","v":0},{"$f":"'Order Form'!$E$10","v":0},{"$f":"'Order Form'!$E$11","v":0},{"$f":"IF(('Order Form'!$E$15=\"YES\"),'Order Form'!$E$12,\"\")","v":0},{"$f":"'Order Form'!$E$13 & \"\"","v":""},{"$f":"IF('Order Form'!D179=\"\",'Order Form'!C179,'Order Form'!D179) & \"\"","v":""},{"$f":"'Order Form'!E179 & \"\"","v":""},{"$f":"'Order Form'!F179","v":0},{"$f":"'Order Form'!I179","v":0},{"$f":"'Order Form'!G179","v":0},{"$f":"'Order Form'!H179","v":0},{"$f":"'Order Form'!J179 & \"\"","v":""},{"$f":"'Order Form'!L179 & \"\"","v":""},{"$f":"'Order Form'!C179 & \"\"","v":""},{"$f":"'Order Form'!K179 & \"\"","v":""},{"$f":"'Order Form'!$E$14","v":"YES"},{"$f":"'Order Form'!$E$19","v":0},{"$f":"'Order Form'!$E$16","v":"FREE gift card"},{"$f":"'Order Form'!$E$17","v":"No thanks"},"No","No",{"$f":"\"Dispatch Week: \"&'Order Form'!$E$18","v":"Dispatch Week: "},{"$f":"\"VIP: \"&'Order Form'!$E$5 &\"; Rib: \"&'Order Form'!$E$17 &\"; GT: \"&'Order Form'!$E$16","v":"VIP: ; Rib: No thanks; GT: FREE gift card"},null,null,null,{"$f":"IF(P159=\"\",\"\",IFERROR(INDIRECT(\"Postcodes!$C\"&SUMPRODUCT(--(Postcodes!$A$2:$A$100<=P159)*(Postcodes!$B$2:$B$100>=P159), ROW(Postcodes!$A$2:$A$100))),\"WRONG CODE\"))","v":0},null,null,null,null,null,null,""]
[{"$f":"'Order Form'!A180","v":159},{"$f":"'Order Form'!M180","v":""},{"$f":"'Order Form'!$E$4","v":0},{"$f":"'Order Form'!$E$5","v":0},{"$f":"'Order Form'!$E$6","v":0},{"$f":"'Order Form'!$E$7","v":0},{"$f":"'Order Form'!$E$9","v":0},{"$f":"'Order Form'!$E$8","v":0},{"$f":"'Order Form'!$E$10","v":0},{"$f":"'Order Form'!$E$11","v":0},{"$f":"IF(('Order Form'!$E$15=\"YES\"),'Order Form'!$E$12,\"\")","v":0},{"$f":"'Order Form'!$E$13 & \"\"","v":""},{"$f":"IF('Order Form'!D180=\"\",'Order Form'!C180,'Order Form'!D180) & \"\"","v":""},{"$f":"'Order Form'!E180 & \"\"","v":""},{"$f":"'Order Form'!F180","v":0},{"$f":"'Order Form'!I180","v":0},{"$f":"'Order Form'!G180","v":0},{"$f":"'Order Form'!H180","v":0},{"$f":"'Order Form'!J180 & \"\"","v":""},{"$f":"'Order Form'!L180 & \"\"","v":""},{"$f":"'Order Form'!C180 & \"\"","v":""},{"$f":"'Order Form'!K180 & \"\"","v":""},{"$f":"'Order Form'!$E$14","v":"YES"},{"$f":"'Order Form'!$E$19","v":0},{"$f":"'Order Form'!$E$16","v":"FREE gift card"},{"$f":"'Order Form'!$E$17","v":"No thanks"},"No","No",{"$f":"\"Dispatch Week: \"&'Order Form'!$E$18","v":"Dispatch Week: "},{"$f":"\"VIP: \"&'Order Form'!$E$5 &\"; Rib: \"&'Order Form'!$E$17 &\"; GT: \"&'Order Form'!$E$16","v":"VIP: ; Rib: No thanks; GT: FREE gift card"},null,null,null,{"$f":"IF(P160=\"\",\"\",IFERROR(INDIRECT(\"Postcodes!$C\"&SUMPRODUCT(--(Postcodes!$A$2:$A$100<=P160)*(Postcodes!$B$2:$B$100>=P160), ROW(Postcodes!$A$2:$A$100))),\"WRONG CODE\"))","v":0},null,null,null,null,null,null,""]
[{"$f":"'Order Form'!A181","v":160},{"$f":"'Order Form'!M181","v":""},{"$f":"'Order Form'!$E$4","v":0},{"$f":"'Order Form'!$E$5","v":0},{"$f":"'Order Form'!$E$6","v":0},{"$f":"'Order Form'!$E$7","v":0},{"$f":"'Order Form'!$E$9","v":0},{"$f":"'Order Form'!$E$8","v":0},{"$f":"'Order Form'!$E$10","v":0},{"$f":"'Order Form'!$E$11","v":0},{"$f":"IF(('Order Form'!$E$15=\"YES\"),'Order Form'!$E$12,\"\")","v":0},{"$f":"'Order Form'!$E$13 & \"\"","v":""},{"$f":"IF('Order Form'!D181=\"\",'Order Form'!C181,'Order Form'!D181) & \"\"","v":""},{"$f":"'Order Form'!E181 & \"\"","v":""},{"$f":"'Order Form'!F181","v":0},{"$f":"'Order Form'!I181","v":0},{"$f":"'Order Form'!G181","v":0},{"$f":"'Order Form'!H181","v":0},{"$f":"'Order Form'!J181 & \"\"","v":""},{"$f":"'Order Form'!L181 & \"\"","v":""},{"$f":"'Order Form'!C181 & \"\"","v":""},{"$f":"'Order Form'!K181 & \"\"","v":""},{"$f":"'Order Form'!$E$14","v":"YES"},{"$f":"'Order Form'!$E$19","v":0},{"$f":"'Order Form'!$E$16","v":"FREE gift card"},{"$f":"'Order Form'!$E$17","v":"No thanks"},"No","No",{"$f":"\"Dispatch Week: \"&'Order Form'!$E$18","v":"Dispatch Week: "},{"$f":"\"VIP: \"&'Order Form'!$E$5 &\"; Rib: \"&'Order Form'!$E$17 &\"; GT: \"&'Order Form'!$E$16","v":"VIP: ; Rib: No thanks; GT: FREE gift card"},null,null,null,{"$f":"IF(P161=\"\",\"\",IFERROR(INDIRECT(\"Postcodes!$C\"&SUMPRODUCT(--(Postcodes!$A$2:$A$100<=P161)*(Postcodes!$B$2:$B$100>=P161), ROW(Postcodes!$A$2:$A$100))),\"WRONG CODE\"))","v":0},null,null,null,null,null,null,""]
[{"$f":"'Order Form'!A182","v":161},{"$f":"'Order Form'!M182","v":""},{"$f":"'Order Form'!$E$4","v":0},{"$f":"'Order Form'!$E$5","v":0},{"$f":"'Order Form'!$E$6","v":0},{"$f":"'Order Form'!$E$7","v":0},{"$f":"'Order Form'!$E$9","v":0},{"$f":"'Order Form'!$E$8","v":0},{"$f":"'Order Form'!$E$10","v":0},{"$f":"'Order Form'!$E$11","v":0},{"$f":"IF(('Order Form'!$E$15=\"YES\"),'Order Form'!$E$12,\"\")","v":0},{"$f":"'Order Form'!$E$13 & \"\"","v":""},{"$f":"IF('Order Form'!D182=\"\",'Order Form'!C182,'Order Form'!D182) & \"\"","v":""},{"$f":"'Order Form'!E182 & \"\"","v":""},{"$f":"'Order Form'!F182","v":0},{"$f":"'Order Form'!I182","v":0},{"$f":"'Order Form'!G182","v":0},{"$f":"'Order Form'!H182","v":0},{"$f":"'Order Form'!J182 & \"\"","v":""},{"$f":"'Order Form'!L182 & \"\"","v":""},{"$f":"'Order Form'!C182 & \"\"","v":""},{"$f":"'Order Form'!K182 & \"\"","v":""},{"$f":"'Order Form'!$E$14","v":"YES"},{"$f":"'Order Form'!$E$19","v":0},{"$f":"'Order Form'!$E$16","v":"FREE gift card"},{"$f":"'Order Form'!$E$17","v":"No thanks"},"No","No",{"$f":"\"Dispatch Week: \"&'Order Form'!$E$18","v":"Dispatch Week: "},{"$f":"\"VIP: \"&'Order Form'!$E$5 &\"; Rib: \"&'Order Form'!$E$17 &\"; GT: \"&'Order Form'!$E$16","v":"VIP: ; Rib: No thanks; GT: FREE gift card"},null,null,null,{"$f":"IF(P162=\"\",\"\",IFERROR(INDIRECT(\"Postcodes!$C\"&SUMPRODUCT(--(Postcodes!$A$2:$A$100<=P162)*(Postcodes!$B$2:$B$100>=P162), ROW(Postcodes!$A$2:$A$100))),\"WRONG CODE\"))","v":0},null,null,null,null,null,null,""]
[{"$f":"'Order Form'!A183","v":162},{"$f":"'Order Form'!M183","v":""},{"$f":"'Order Form'!$E$4","v":0},{"$f":"'Order Form'!$E$5","v":0},{"$f":"'Order Form'!$E$6","v":0},{"$f":"'Order Form'!$E$7","v":0},{"$f":"'Order Form'!$E$9","v":0},{"$f":"'Order Form'!$E$8","v":0},{"$f":"'Order Form'!$E$10","v":0},{"$f":"'Order Form'!$E$11","v":0},{"$f":"IF(('Order Form'!$E$15=\"YES\"),'Order Form'!$E$12,\"\")","v":0},{"$f":"'Order Form'!$E$13 & \"\"","v":""},{"$f":"IF('Order Form'!D183=\"\",'Order Form'!C183,'Order Form'!D183) & \"\"","v":""},{"$f":"'Order Form'!E183 & \"\"","v":""},{"$f":"'Order Form'!F183","v":0},{"$f":"'Order Form'!I183","v":0},{"$f":"'Order Form'!G183","v":0},{"$f":"'Order Form'!H183","v":0},{"$f":"'Order Form'!J183 & \"\"","v":""},{"$f":"'Order Form'!L183 & \"\"","v":""},{"$f":"'Order Form'!C183 & \"\"","v":""},{"$f":"'Order Form'!K183 & \"\"","v":""},{"$f":"'Order Form'!$E$14","v":"YES"},{"$f":"'Order Form'!$E$19","v":0},{"$f":"'Order Form'!$E$16","v":"FREE gift card"},{"$f":"'Order Form'!$E$17","v":"No thanks"},"No","No",{"$f":"\"Dispatch Week: \"&'Order Form'!$E$18","v":"Dispatch Week: "},{"$f":"\"VIP: \"&'Order Form'!$E$5 &\"; Rib: \"&'Order Form'!$E$17 &\"; GT: \"&'Order Form'!$E$16","v":"VIP: ; Rib: No thanks; GT: FREE gift card"},null,null,null,{"$f":"IF(P163=\"\",\"\",IFERROR(INDIRECT(\"Postcodes!$C\"&SUMPRODUCT(--(Postcodes!$A$2:$A$100<=P163)*(Postcodes!$B$2:$B$100>=P163), ROW(Postcodes!$A$2:$A$100))),\"WRONG CODE\"))","v":0},null,null,null,null,null,null,""]
[{"$f":"'Order Form'!A184","v":163},{"$f":"'Order Form'!M184","v":""},{"$f":"'Order Form'!$E$4","v":0},{"$f":"'Order Form'!$E$5","v":0},{"$f":"'Order Form'!$E$6","v":0},{"$f":"'Order Form'!$E$7","v":0},{"$f":"'Order Form'!$E$9","v":0},{"$f":"'Order Form'!$E$8","v":0},{"$f":"'Order Form'!$E$10","v":0},{"$f":"'Order Form'!$E$11","v":0},{"$f":"IF(('Order Form'!$E$15=\"YES\"),'Order Form'!$E$12,\"\")","v":0},{"$f":"'Order Form'!$E$13 & \"\"","v":""},{"$f":"IF('Order Form'!D184=\"\",'Order Form'!C184,'Order Form'!D184) & \"\"","v":""},{"$f":"'Order Form'!E184 & \"\"","v":""},{"$f":"'Order Form'!F184","v":0},{"$f":"'Order Form'!I184","v":0},{"$f":"'Order Form'!G184","v":0},{"$f":"'Order Form'!H184","v":0},{"$f":"'Order Form'!J184 & \"\"","v":""},{"$f":"'Order Form'!L184 & \"\"","v":""},{"$f":"'Order Form'!C184 & \"\"","v":""},{"$f":"'Order Form'!K184 & \"\"","v":""},{"$f":"'Order Form'!$E$14","v":"YES"},{"$f":"'Order Form'!$E$19","v":0},{"$f":"'Order Form'!$E$16","v":"FREE gift card"},{"$f":"'Order Form'!$E$17","v":"No thanks"},"No","No",{"$f":"\"Dispatch Week: \"&'Order Form'!$E$18","v":"Dispatch Week: "},{"$f":"\"VIP: \"&'Order Form'!$E$5 &\"; Rib: \"&'Order Form'!$E$17 &\"; GT: \"&'Order Form'!$E$16","v":"VIP: ; Rib: No thanks; GT: FREE gift card"},null,null,null,{"$f":"IF(P164=\"\",\"\",IFERROR(INDIRECT(\"Postcodes!$C\"&SUMPRODUCT(--(Postcodes!$A$2:$A$100<=P164)*(Postcodes!$B$2:$B$100>=P164), ROW(Postcodes!$A$2:$A$100))),\"WRONG CODE\"))","v":0},null,null,null,null,null,null,""]
[{"$f":"'Order Form'!A185","v":164},{"$f":"'Order Form'!M185","v":""},{"$f":"'Order Form'!$E$4","v":0},{"$f":"'Order Form'!$E$5","v":0},{"$f":"'Order Form'!$E$6","v":0},{"$f":"'Order Form'!$E$7","v":0},{"$f":"'Order Form'!$E$9","v":0},{"$f":"'Order Form'!$E$8","v":0},{"$f":"'Order Form'!$E$10","v":0},{"$f":"'Order Form'!$E$11","v":0},{"$f":"IF(('Order Form'!$E$15=\"YES\"),'Order Form'!$E$12,\"\")","v":0},{"$f":"'Order Form'!$E$13 & \"\"","v":""},{"$f":"IF('Order Form'!D185=\"\",'Order Form'!C185,'Order Form'!D185) & \"\"","v":""},{"$f":"'Order Form'!E185 & \"\"","v":""},{"$f":"'Order Form'!F185","v":0},{"$f":"'Order Form'!I185","v":0},{"$f":"'Order Form'!G185","v":0},{"$f":"'Order Form'!H185","v":0},{"$f":"'Order Form'!J185 & \"\"","v":""},{"$f":"'Order Form'!L185 & \"\"","v":""},{"$f":"'Order Form'!C185 & \"\"","v":""},{"$f":"'Order Form'!K185 & \"\"","v":""},{"$f":"'Order Form'!$E$14","v":"YES"},{"$f":"'Order Form'!$E$19","v":0},{"$f":"'Order Form'!$E$16","v":"FREE gift card"},{"$f":"'Order Form'!$E$17","v":"No thanks"},"No","No",{"$f":"\"Dispatch Week: \"&'Order Form'!$E$18","v":"Dispatch Week: "},{"$f":"\"VIP: \"&'Order Form'!$E$5 &\"; Rib: \"&'Order Form'!$E$17 &\"; GT: \"&'Order Form'!$E$16","v":"VIP: ; Rib: No thanks; GT: FREE gift card"},null,null,null,{"$f":"IF(P165=\"\",\"\",IFERROR(INDIRECT(\"Postcodes!$C\"&SUMPRODUCT(--(Postcodes!$A$2:$A$100<=P165)*(Postcodes!$B$2:$B$100>=P165), ROW(Postcodes!$A$2:$A$100))),\"WRONG CODE\"))","v":0},null,null,null,null,null,null,""]
[{"$f":"'Order Form'!A186","v":165},{"$f":"'Order Form'!M186","v":""},{"$f":"'Order Form'!$E$4","v":0},{"$f":"'Order Form'!$E$5","v":0},{"$f":"'Order Form'!$E$6","v":0},{"$f":"'Order Form'!$E$7","v":0},{"$f":"'Order Form'!$E$9","v":0},{"$f":"'Order Form'!$E$8","v":0},{"$f":"'Order Form'!$E$10","v":0},{"$f":"'Order Form'!$E$11","v":0},{"$f":"IF(('Order Form'!$E$15=\"YES\"),'Order Form'!$E$12,\"\")","v":0},{"$f":"'Order Form'!$E$13 & \"\"","v":""},{"$f":"IF('Order Form'!D186=\"\",'Order Form'!C186,'Order Form'!D186) & \"\"","v":""},{"$f":"'Order Form'!E186 & \"\"","v":""},{"$f":"'Order Form'!F186","v":0},{"$f":"'Order Form'!I186","v":0},{"$f":"'Order Form'!G186","v":0},{"$f":"'Order Form'!H186","v":0},{"$f":"'Order Form'!J186 & \"\"","v":""},{"$f":"'Order Form'!L186 & \"\"","v":""},{"$f":"'Order Form'!C186 & \"\"","v":""},{"$f":"'Order Form'!K186 & \"\"","v":""},{"$f":"'Order Form'!$E$14","v":"YES"},{"$f":"'Order Form'!$E$19","v":0},{"$f":"'Order Form'!$E$16","v":"FREE gift card"},{"$f":"'Order Form'!$E$17","v":"No thanks"},"No","No",{"$f":"\"Dispatch Week: \"&'Order Form'!$E$18","v":"Dispatch Week: "},{"$f":"\"VIP: \"&'Order Form'!$E$5 &\"; Rib: \"&'Order Form'!$E$17 &\"; GT: \"&'Order Form'!$E$16","v":"VIP: ; Rib: No thanks; GT: FREE gift card"},null,null,null,{"$f":"IF(P166=\"\",\"\",IFERROR(INDIRECT(\"Postcodes!$C\"&SUMPRODUCT(--(Postcodes!$A$2:$A$100<=P166)*(Postcodes!$B$2:$B$100>=P166), ROW(Postcodes!$A$2:$A$100))),\"WRONG CODE\"))","v":0},null,null,null,null,null,null,""]
[{"$f":"'Order Form'!A187","v":166},{"$f":"'Order Form'!M187","v":""},{"$f":"'Order Form'!$E$4","v":0},{"$f":"'Order Form'!$E$5","v":0},{"$f":"'Order Form'!$E$6","v":0},{"$f":"'Order Form'!$E$7","v":0},{"$f":"'Order Form'!$E$9","v":0},{"$f":"'Order Form'!$E$8","v":0},{"$f":"'Order Form'!$E$10","v":0},{"$f":"'Order Form'!$E$11","v":0},{"$f":"IF(('Order Form'!$E$15=\"YES\"),'Order Form'!$E$12,\"\")","v":0},{"$f":"'Order Form'!$E$13 & \"\"","v":""},{"$f":"IF('Order Form'!D187=\"\",'Order Form'!C187,'Order Form'!D187) & \"\"","v":""},{"$f":"'Order Form'!E187 & \"\"","v":""},{"$f":"'Order Form'!F187","v":0},{"$f":"'Order Form'!I187","v":0},{"$f":"'Order Form'!G187","v":0},{"$f":"'Order Form'!H187","v":0},{"$f":"'Order Form'!J187 & \"\"","v":""},{"$f":"'Order Form'!L187 & \"\"","v":""},{"$f":"'Order Form'!C187 & \"\"","v":""},{"$f":"'Order Form'!K187 & \"\"","v":""},{"$f":"'Order Form'!$E$14","v":"YES"},{"$f":"'Order Form'!$E$19","v":0},{"$f":"'Order Form'!$E$16","v":"FREE gift card"},{"$f":"'Order Form'!$E$17","v":"No thanks"},"No","No",{"$f":"\"Dispatch Week: \"&'Order Form'!$E$18","v":"Dispatch Week: "},{"$f":"\"VIP: \"&'Order Form'!$E$5 &\"; Rib: \"&'Order Form'!$E$17 &\"; GT: \"&'Order Form'!$E$16","v":"VIP: ; Rib: No thanks; GT: FREE gift card"},null,null,null,{"$f":"IF(P167=\"\",\"\",IFERROR(INDIRECT(\"Postcodes!$C\"&SUMPRODUCT(--(Postcodes!$A$2:$A$100<=P167)*(Postcodes!$B$2:$B$100>=P167), ROW(Postcodes!$A$2:$A$100))),\"WRONG CODE\"))","v":0},null,null,null,null,null,null,""]
[{"$f":"'Order Form'!A188","v":167},{"$f":"'Order Form'!M188","v":""},{"$f":"'Order Form'!$E$4","v":0},{"$f":"'Order Form'!$E$5","v":0},{"$f":"'Order Form'!$E$6","v":0},{"$f":"'Order Form'!$E$7","v":0},{"$f":"'Order Form'!$E$9","v":0},{"$f":"'Order Form'!$E$8","v":0},{"$f":"'Order Form'!$E$10","v":0},{"$f":"'Order Form'!$E$11","v":0},{"$f":"IF(('Order Form'!$E$15=\"YES\"),'Order Form'!$E$12,\"\")","v":0},{"$f":"'Order Form'!$E$13 & \"\"","v":""},{"$f":"IF('Order Form'!D188=\"\",'Order Form'!C188,'Order Form'!D188) & \"\"","v":""},{"$f":"'Order Form'!E188 & \"\"","v":""},{"$f":"'Order Form'!F188","v":0},{"$f":"'Order Form'!I188","v":0},{"$f":"'Order Form'!G188","v":0},{"$f":"'Order Form'!H188","v":0},{"$f":"'Order Form'!J188 & \"\"","v":""},{"$f":"'Order Form'!L188 & \"\"","v":""},{"$f":"'Order Form'!C188 & \"\"","v":""},{"$f":"'Order Form'!K188 & \"\"","v":""},{"$f":"'Order Form'!$E$14","v":"YES"},{"$f":"'Order Form'!$E$19","v":0},{"$f":"'Order Form'!$E$16","v":"FREE gift card"},{"$f":"'Order Form'!$E$17","v":"No thanks"},"No","No",{"$f":"\"Dispatch Week: \"&'Order Form'!$E$18","v":"Dispatch Week: "},{"$f":"\"VIP: \"&'Order Form'!$E$5 &\"; Rib: \"&'Order Form'!$E$17 &\"; GT: \"&'Order Form'!$E$16","v":"VIP: ; Rib: No thanks; GT: FREE gift card"},null,null,null,{"$f":"IF(P168=\"\",\"\",IFERROR(INDIRECT(\"Postcodes!$C\"&SUMPRODUCT(--(Postcodes!$A$2:$A$100<=P168)*(Postcodes!$B$2:$B$100>=P168), ROW(Postcodes!$A$2:$A$100))),\"WRONG CODE\"))","v":0},null,null,null,null,null,null,""]
[{"$f":"'Order Form'!A189","v":168},{"$f":"'Order Form'!M189","v":""},{"$f":"'Order Form'!$E$4","v":0},{"$f":"'Order Form'!$E$5","v":0},{"$f":"'Order Form'!$E$6","v":0},{"$f":"'Order Form'!$E$7","v":0},{"$f":"'Order Form'!$E$9","v":0},{"$f":"'Order Form'!$E$8","v":0},{"$f":"'Order Form'!$E$10","v":0},{"$f":"'Order Form'!$E$11","v":0},{"$f":"IF(('Order Form'!$E$15=\"YES\"),'Order Form'!$E$12,\"\")","v":0},{"$f":"'Order Form'!$E$13 & \"\"","v":""},{"$f":"IF('Order Form'!D189=\"\",'Order Form'!C189,'Order Form'!D189) & \"\"","v":""},{"$f":"'Order Form'!E189 & \"\"","v":""},{"$f":"'Order Form'!F189","v":0},{"$f":"'Order Form'!I189","v":0},{"$f":"'Order Form'!G189","v":0},{"$f":"'Order Form'!H189","v":0},{"$f":"'Order Form'!J189 & \"\"","v":""},{"$f":"'Order Form'!L189 & \"\"","v":""},{"$f":"'Order Form'!C189 & \"\"","v":""},{"$f":"'Order Form'!K189 & \"\"","v":""},{"$f":"'Order Form'!$E$14","v":"YES"},{"$f":"'Order Form'!$E$19","v":0},{"$f":"'Order Form'!$E$16","v":"FREE gift card"},{"$f":"'Order Form'!$E$17","v":"No thanks"},"No","No",{"$f":"\"Dispatch Week: \"&'Order Form'!$E$18","v":"Dispatch Week: "},{"$f":"\"VIP: \"&'Order Form'!$E$5 &\"; Rib: \"&'Order Form'!$E$17 &\"; GT: \"&'Order Form'!$E$16","v":"VIP: ; Rib: No thanks; GT: FREE gift card"},null,null,null,{"$f":"IF(P169=\"\",\"\",IFERROR(INDIRECT(\"Postcodes!$C\"&SUMPRODUCT(--(Postcodes!$A$2:$A$100<=P169)*(Postcodes!$B$2:$B$100>=P169), ROW(Postcodes!$A$2:$A$100))),\"WRONG CODE\"))","v":0},null,null,null,null,null,null,""]
[{"$f":"'Order Form'!A190","v":169},{"$f":"'Order Form'!M190","v":""},{"$f":"'Order Form'!$E$4","v":0},{"$f":"'Order Form'!$E$5","v":0},{"$f":"'Order Form'!$E$6","v":0},{"$f":"'Order Form'!$E$7","v":0},{"$f":"'Order Form'!$E$9","v":0},{"$f":"'Order Form'!$E$8","v":0},{"$f":"'Order Form'!$E$10","v":0},{"$f":"'Order Form'!$E$11","v":0},{"$f":"IF(('Order Form'!$E$15=\"YES\"),'Order Form'!$E$12,\"\")","v":0},{"$f":"'Order Form'!$E$13 & \"\"","v":""},{"$f":"IF('Order Form'!D190=\"\",'Order Form'!C190,'Order Form'!D190) & \"\"","v":""},{"$f":"'Order Form'!E190 & \"\"","v":""},{"$f":"'Order Form'!F190","v":0},{"$f":"'Order Form'!I190","v":0},{"$f":"'Order Form'!G190","v":0},{"$f":"'Order Form'!H190","v":0},{"$f":"'Order Form'!J190 & \"\"","v":""},{"$f":"'Order Form'!L190 & \"\"","v":""},{"$f":"'Order Form'!C190 & \"\"","v":""},{"$f":"'Order Form'!K190 & \"\"","v":""},{"$f":"'Order Form'!$E$14","v":"YES"},{"$f":"'Order Form'!$E$19","v":0},{"$f":"'Order Form'!$E$16","v":"FREE gift card"},{"$f":"'Order Form'!$E$17","v":"No thanks"},"No","No",{"$f":"\"Dispatch Week: \"&'Order Form'!$E$18","v":"Dispatch Week: "},{"$f":"\"VIP: \"&'Order Form'!$E$5 &\"; Rib: \"&'Order Form'!$E$17 &\"; GT: \"&'Order Form'!$E$16","v":"VIP: ; Rib: No thanks; GT: FREE gift card"},null,null,null,{"$f":"IF(P170=\"\",\"\",IFERROR(INDIRECT(\"Postcodes!$C\"&SUMPRODUCT(--(Postcodes!$A$2:$A$100<=P170)*(Postcodes!$B$2:$B$100>=P170), ROW(Postcodes!$A$2:$A$100))),\"WRONG CODE\"))","v":0},null,null,null,null,null,null,""]
[{"$f":"'Order Form'!A191","v":170},{"$f":"'Order Form'!M191","v":""},{"$f":"'Order Form'!$E$4","v":0},{"$f":"'Order Form'!$E$5","v":0},{"$f":"'Order Form'!$E$6","v":0},{"$f":"'Order Form'!$E$7","v":0},{"$f":"'Order Form'!$E$9","v":0},{"$f":"'Order Form'!$E$8","v":0},{"$f":"'Order Form'!$E$10","v":0},{"$f":"'Order Form'!$E$11","v":0},{"$f":"IF(('Order Form'!$E$15=\"YES\"),'Order Form'!$E$12,\"\")","v":0},{"$f":"'Order Form'!$E$13 & \"\"","v":""},{"$f":"IF('Order Form'!D191=\"\",'Order Form'!C191,'Order Form'!D191) & \"\"","v":""},{"$f":"'Order Form'!E191 & \"\"","v":""},{"$f":"'Order Form'!F191","v":0},{"$f":"'Order Form'!I191","v":0},{"$f":"'Order Form'!G191","v":0},{"$f":"'Order Form'!H191","v":0},{"$f":"'Order Form'!J191 & \"\"","v":""},{"$f":"'Order Form'!L191 & \"\"","v":""},{"$f":"'Order Form'!C191 & \"\"","v":""},{"$f":"'Order Form'!K191 & \"\"","v":""},{"$f":"'Order Form'!$E$14","v":"YES"},{"$f":"'Order Form'!$E$19","v":0},{"$f":"'Order Form'!$E$16","v":"FREE gift card"},{"$f":"'Order Form'!$E$17","v":"No thanks"},"No","No",{"$f":"\"Dispatch Week: \"&'Order Form'!$E$18","v":"Dispatch Week: "},{"$f":"\"VIP: \"&'Order Form'!$E$5 &\"; Rib: \"&'Order Form'!$E$17 &\"; GT: \"&'Order Form'!$E$16","v":"VIP: ; Rib: No thanks; GT: FREE gift card"},null,null,null,{"$f":"IF(P171=\"\",\"\",IFERROR(INDIRECT(\"Postcodes!$C\"&SUMPRODUCT(--(Postcodes!$A$2:$A$100<=P171)*(Postcodes!$B$2:$B$100>=P171), ROW(Postcodes!$A$2:$A$100))),\"WRONG CODE\"))","v":0},null,null,null,null,null,null,""]
[{"$f":"'Order Form'!A192","v":171},{"$f":"'Order Form'!M192","v":""},{"$f":"'Order Form'!$E$4","v":0},{"$f":"'Order Form'!$E$5","v":0},{"$f":"'Order Form'!$E$6","v":0},{"$f":"'Order Form'!$E$7","v":0},{"$f":"'Order Form'!$E$9","v":0},{"$f":"'Order Form'!$E$8","v":0},{"$f":"'Order Form'!$E$10","v":0},{"$f":"'Order Form'!$E$11","v":0},{"$f":"IF(('Order Form'!$E$15=\"YES\"),'Order Form'!$E$12,\"\")","v":0},{"$f":"'Order Form'!$E$13 & \"\"","v":""},{"$f":"IF('Order Form'!D192=\"\",'Order Form'!C192,'Order Form'!D192) & \"\"","v":""},{"$f":"'Order Form'!E192 & \"\"","v":""},{"$f":"'Order Form'!F192","v":0},{"$f":"'Order Form'!I192","v":0},{"$f":"'Order Form'!G192","v":0},{"$f":"'Order Form'!H192","v":0},{"$f":"'Order Form'!J192 & \"\"","v":""},{"$f":"'Order Form'!L192 & \"\"","v":""},{"$f":"'Order Form'!C192 & \"\"","v":""},{"$f":"'Order Form'!K192 & \"\"","v":""},{"$f":"'Order Form'!$E$14","v":"YES"},{"$f":"'Order Form'!$E$19","v":0},{"$f":"'Order Form'!$E$16","v":"FREE gift card"},{"$f":"'Order Form'!$E$17","v":"No thanks"},"No","No",{"$f":"\"Dispatch Week: \"&'Order Form'!$E$18","v":"Dispatch Week: "},{"$f":"\"VIP: \"&'Order Form'!$E$5 &\"; Rib: \"&'Order Form'!$E$17 &\"; GT: \"&'Order Form'!$E$16","v":"VIP: ; Rib: No thanks; GT: FREE gift card"},null,null,null,{"$f":"IF(P172=\"\",\"\",IFERROR(INDIRECT(\"Postcodes!$C\"&SUMPRODUCT(--(Postcodes!$A$2:$A$100<=P172)*(Postcodes!$B$2:$B$100>=P172), ROW(Postcodes!$A$2:$A$100))),\"WRONG CODE\"))","v":0},null,null,null,null,null,null,""]
[{"$f":"'Order Form'!A193","v":172},{"$f":"'Order Form'!M193","v":""},{"$f":"'Order Form'!$E$4","v":0},{"$f":"'Order Form'!$E$5","v":0},{"$f":"'Order Form'!$E$6","v":0},{"$f":"'Order Form'!$E$7","v":0},{"$f":"'Order Form'!$E$9","v":0},{"$f":"'Order Form'!$E$8","v":0},{"$f":"'Order Form'!$E$10","v":0},{"$f":"'Order Form'!$E$11","v":0},{"$f":"IF(('Order Form'!$E$15=\"YES\"),'Order Form'!$E$12,\"\")","v":0},{"$f":"'Order Form'!$E$13 & \"\"","v":""},{"$f":"IF('Order Form'!D193=\"\",'Order Form'!C193,'Order Form'!D193) & \"\"","v":""},{"$f":"'Order Form'!E193 & \"\"","v":""},{"$f":"'Order Form'!F193","v":0},{"$f":"'Order Form'!I193","v":0},{"$f":"'Order Form'!G193","v":0},{"$f":"'Order Form'!H193","v":0},{"$f":"'Order Form'!J193 & \"\"","v":""},{"$f":"'Order Form'!L193 & \"\"","v":""},{"$f":"'Order Form'!C193 & \"\"","v":""},{"$f":"'Order Form'!K193 & \"\"","v":""},{"$f":"'Order Form'!$E$14","v":"YES"},{"$f":"'Order Form'!$E$19","v":0},{"$f":"'Order Form'!$E$16","v":"FREE gift card"},{"$f":"'Order Form'!$E$17","v":"No thanks"},"No","No",{"$f":"\"Dispatch Week: \"&'Order Form'!$E$18","v":"Dispatch Week: "},{"$f":"\"VIP: \"&'Order Form'!$E$5 &\"; Rib: \"&'Order Form'!$E$17 &\"; GT: \"&'Order Form'!$E$16","v":"VIP: ; Rib: No thanks; GT: FREE gift card"},null,null,null,{"$f":"IF(P173=\"\",\"\",IFERROR(INDIRECT(\"Postcodes!$C\"&SUMPRODUCT(--(Postcodes!$A$2:$A$100<=P173)*(Postcodes!$B$2:$B$100>=P173), ROW(Postcodes!$A$2:$A$100))),\"WRONG CODE\"))","v":0},null,null,null,null,null,null,""]
[{"$f":"'Order Form'!A194","v":173},{"$f":"'Order Form'!M194","v":""},{"$f":"'Order Form'!$E$4","v":0},{"$f":"'Order Form'!$E$5","v":0},{"$f":"'Order Form'!$E$6","v":0},{"$f":"'Order Form'!$E$7","v":0},{"$f":"'Order Form'!$E$9","v":0},{"$f":"'Order Form'!$E$8","v":0},{"$f":"'Order Form'!$E$10","v":0},{"$f":"'Order Form'!$E$11","v":0},{"$f":"IF(('Order Form'!$E$15=\"YES\"),'Order Form'!$E$12,\"\")","v":0},{"$f":"'Order Form'!$E$13 & \"\"","v":""},{"$f":"IF('Order Form'!D194=\"\",'Order Form'!C194,'Order Form'!D194) & \"\"","v":""},{"$f":"'Order Form'!E194 & \"\"","v":""},{"$f":"'Order Form'!F194","v":0},{"$f":"'Order Form'!I194","v":0},{"$f":"'Order Form'!G194","v":0},{"$f":"'Order Form'!H194","v":0},{"$f":"'Order Form'!J194 & \"\"","v":""},{"$f":"'Order Form'!L194 & \"\"","v":""},{"$f":"'Order Form'!C194 & \"\"","v":""},{"$f":"'Order Form'!K194 & \"\"","v":""},{"$f":"'Order Form'!$E$14","v":"YES"},{"$f":"'Order Form'!$E$19","v":0},{"$f":"'Order Form'!$E$16","v":"FREE gift card"},{"$f":"'Order Form'!$E$17","v":"No thanks"},"No","No",{"$f":"\"Dispatch Week: \"&'Order Form'!$E$18","v":"Dispatch Week: "},{"$f":"\"VIP: \"&'Order Form'!$E$5 &\"; Rib: \"&'Order Form'!$E$17 &\"; GT: \"&'Order Form'!$E$16","v":"VIP: ; Rib: No thanks; GT: FREE gift card"},null,null,null,{"$f":"IF(P174=\"\",\"\",IFERROR(INDIRECT(\"Postcodes!$C\"&SUMPRODUCT(--(Postcodes!$A$2:$A$100<=P174)*(Postcodes!$B$2:$B$100>=P174), ROW(Postcodes!$A$2:$A$100))),\"WRONG CODE\"))","v":0},null,null,null,null,null,null,""]
[{"$f":"'Order Form'!A195","v":174},{"$f":"'Order Form'!M195","v":""},{"$f":"'Order Form'!$E$4","v":0},{"$f":"'Order Form'!$E$5","v":0},{"$f":"'Order Form'!$E$6","v":0},{"$f":"'Order Form'!$E$7","v":0},{"$f":"'Order Form'!$E$9","v":0},{"$f":"'Order Form'!$E$8","v":0},{"$f":"'Order Form'!$E$10","v":0},{"$f":"'Order Form'!$E$11","v":0},{"$f":"IF(('Order Form'!$E$15=\"YES\"),'Order Form'!$E$12,\"\")","v":0},{"$f":"'Order Form'!$E$13 & \"\"","v":""},{"$f":"IF('Order Form'!D195=\"\",'Order Form'!C195,'Order Form'!D195) & \"\"","v":""},{"$f":"'Order Form'!E195 & \"\"","v":""},{"$f":"'Order Form'!F195","v":0},{"$f":"'Order Form'!I195","v":0},{"$f":"'Order Form'!G195","v":0},{"$f":"'Order Form'!H195","v":0},{"$f":"'Order Form'!J195 & \"\"","v":""},{"$f":"'Order Form'!L195 & \"\"","v":""},{"$f":"'Order Form'!C195 & \"\"","v":""},{"$f":"'Order Form'!K195 & \"\"","v":""},{"$f":"'Order Form'!$E$14","v":"YES"},{"$f":"'Order Form'!$E$19","v":0},{"$f":"'Order Form'!$E$16","v":"FREE gift card"},{"$f":"'Order Form'!$E$17","v":"No thanks"},"No","No",{"$f":"\"Dispatch Week: \"&'Order Form'!$E$18","v":"Dispatch Week: "},{"$f":"\"VIP: \"&'Order Form'!$E$5 &\"; Rib: \"&'Order Form'!$E$17 &\"; GT: \"&'Order Form'!$E$16","v":"VIP: ; Rib: No thanks; GT: FREE gift card"},null,null,null,{"$f":"IF(P175=\"\",\"\",IFERROR(INDIRECT(\"Postcodes!$C\"&SUMPRODUCT(--(Postcodes!$A$2:$A$100<=P175)*(Postcodes!$B$2:$B$100>=P175), ROW(Postcodes!$A$2:$A$100))),\"WRONG CODE\"))","v":0},null,null,null,null,null,null,""]
[{"$f":"'Order Form'!A196","v":175},{"$f":"'Order Form'!M196","v":""},{"$f":"'Order Form'!$E$4","v":0},{"$f":"'Order Form'!$E$5","v":0},{"$f":"'Order Form'!$E$6","v":0},{"$f":"'Order Form'!$E$7","v":0},{"$f":"'Order Form'!$E$9","v":0},{"$f":"'Order Form'!$E$8","v":0},{"$f":"'Order Form'!$E$10","v":0},{"$f":"'Order Form'!$E$11","v":0},{"$f":"IF(('Order Form'!$E$15=\"YES\"),'Order Form'!$E$12,\"\")","v":0},{"$f":"'Order Form'!$E$13 & \"\"","v":""},{"$f":"IF('Order Form'!D196=\"\",'Order Form'!C196,'Order Form'!D196) & \"\"","v":""},{"$f":"'Order Form'!E196 & \"\"","v":""},{"$f":"'Order Form'!F196","v":0},{"$f":"'Order Form'!I196","v":0},{"$f":"'Order Form'!G196","v":0},{"$f":"'Order Form'!H196","v":0},{"$f":"'Order Form'!J196 & \"\"","v":""},{"$f":"'Order Form'!L196 & \"\"","v":""},{"$f":"'Order Form'!C196 & \"\"","v":""},{"$f":"'Order Form'!K196 & \"\"","v":""},{"$f":"'Order Form'!$E$14","v":"YES"},{"$f":"'Order Form'!$E$19","v":0},{"$f":"'Order Form'!$E$16","v":"FREE gift card"},{"$f":"'Order Form'!$E$17","v":"No thanks"},"No","No",{"$f":"\"Dispatch Week: \"&'Order Form'!$E$18","v":"Dispatch Week: "},{"$f":"\"VIP: \"&'Order Form'!$E$5 &\"; Rib: \"&'Order Form'!$E$17 &\"; GT: \"&'Order Form'!$E$16","v":"VIP: ; Rib: No thanks; GT: FREE gift card"},null,null,null,{"$f":"IF(P176=\"\",\"\",IFERROR(INDIRECT(\"Postcodes!$C\"&SUMPRODUCT(--(Postcodes!$A$2:$A$100<=P176)*(Postcodes!$B$2:$B$100>=P176), ROW(Postcodes!$A$2:$A$100))),\"WRONG CODE\"))","v":0},null,null,null,null,null,null,""]
[{"$f":"'Order Form'!A197","v":176},{"$f":"'Order Form'!M197","v":""},{"$f":"'Order Form'!$E$4","v":0},{"$f":"'Order Form'!$E$5","v":0},{"$f":"'Order Form'!$E$6","v":0},{"$f":"'Order Form'!$E$7","v":0},{"$f":"'Order Form'!$E$9","v":0},{"$f":"'Order Form'!$E$8","v":0},{"$f":"'Order Form'!$E$10","v":0},{"$f":"'Order Form'!$E$11","v":0},{"$f":"IF(('Order Form'!$E$15=\"YES\"),'Order Form'!$E$12,\"\")","v":0},{"$f":"'Order Form'!$E$13 & \"\"","v":""},{"$f":"IF('Order Form'!D197=\"\",'Order Form'!C197,'Order Form'!D197) & \"\"","v":""},{"$f":"'Order Form'!E197 & \"\"","v":""},{"$f":"'Order Form'!F197","v":0},{"$f":"'Order Form'!I197","v":0},{"$f":"'Order Form'!G197","v":0},{"$f":"'Order Form'!H197","v":0},{"$f":"'Order Form'!J197 & \"\"","v":""},{"$f":"'Order Form'!L197 & \"\"","v":""},{"$f":"'Order Form'!C197 & \"\"","v":""},{"$f":"'Order Form'!K197 & \"\"","v":""},{"$f":"'Order Form'!$E$14","v":"YES"},{"$f":"'Order Form'!$E$19","v":0},{"$f":"'Order Form'!$E$16","v":"FREE gift card"},{"$f":"'Order Form'!$E$17","v":"No thanks"},"No","No",{"$f":"\"Dispatch Week: \"&'Order Form'!$E$18","v":"Dispatch Week: "},{"$f":"\"VIP: \"&'Order Form'!$E$5 &\"; Rib: \"&'Order Form'!$E$17 &\"; GT: \"&'Order Form'!$E$16","v":"VIP: ; Rib: No thanks; GT: FREE gift card"},null,null,null,{"$f":"IF(P177=\"\",\"\",IFERROR(INDIRECT(\"Postcodes!$C\"&SUMPRODUCT(--(Postcodes!$A$2:$A$100<=P177)*(Postcodes!$B$2:$B$100>=P177), ROW(Postcodes!$A$2:$A$100))),\"WRONG CODE\"))","v":0},null,null,null,null,null,null,""]
[{"$f":"'Order Form'!A198","v":177},{"$f":"'Order Form'!M198","v":""},{"$f":"'Order Form'!$E$4","v":0},{"$f":"'Order Form'!$E$5","v":0},{"$f":"'Order Form'!$E$6","v":0},{"$f":"'Order Form'!$E$7","v":0},{"$f":"'Order Form'!$E$9","v":0},{"$f":"'Order Form'!$E$8","v":0},{"$f":"'Order Form'!$E$10","v":0},{"$f":"'Order Form'!$E$11","v":0},{"$f":"IF(('Order Form'!$E$15=\"YES\"),'Order Form'!$E$12,\"\")","v":0},{"$f":"'Order Form'!$E$13 & \"\"","v":""},{"$f":"IF('Order Form'!D198=\"\",'Order Form'!C198,'Order Form'!D198) & \"\"","v":""},{"$f":"'Order Form'!E198 & \"\"","v":""},{"$f":"'Order Form'!F198","v":0},{"$f":"'Order Form'!I198","v":0},{"$f":"'Order Form'!G198","v":0},{"$f":"'Order Form'!H198","v":0},{"$f":"'Order Form'!J198 & \"\"","v":""},{"$f":"'Order Form'!L198 & \"\"","v":""},{"$f":"'Order Form'!C198 & \"\"","v":""},{"$f":"'Order Form'!K198 & \"\"","v":""},{"$f":"'Order Form'!$E$14","v":"YES"},{"$f":"'Order Form'!$E$19","v":0},{"$f":"'Order Form'!$E$16","v":"FREE gift card"},{"$f":"'Order Form'!$E$17","v":"No thanks"},"No","No",{"$f":"\"Dispatch Week: \"&'Order Form'!$E$18","v":"Dispatch Week: "},{"$f":"\"VIP: \"&'Order Form'!$E$5 &\"; Rib: \"&'Order Form'!$E$17 &\"; GT: \"&'Order Form'!$E$16","v":"VIP: ; Rib: No thanks; GT: FREE gift card"},null,null,null,{"$f":"IF(P178=\"\",\"\",IFERROR(INDIRECT(\"Postcodes!$C\"&SUMPRODUCT(--(Postcodes!$A$2:$A$100<=P178)*(Postcodes!$B$2:$B$100>=P178), ROW(Postcodes!$A$2:$A$100))),\"WRONG CODE\"))","v":0},null,null,null,null,null,null,""]
[{"$f":"'Order Form'!A199","v":178},{"$f":"'Order Form'!M199","v":""},{"$f":"'Order Form'!$E$4","v":0},{"$f":"'Order Form'!$E$5","v":0},{"$f":"'Order Form'!$E$6","v":0},{"$f":"'Order Form'!$E$7","v":0},{"$f":"'Order Form'!$E$9","v":0},{"$f":"'Order Form'!$E$8","v":0},{"$f":"'Order Form'!$E$10","v":0},{"$f":"'Order Form'!$E$11","v":0},{"$f":"IF(('Order Form'!$E$15=\"YES\"),'Order Form'!$E$12,\"\")","v":0},{"$f":"'Order Form'!$E$13 & \"\"","v":""},{"$f":"IF('Order Form'!D199=\"\",'Order Form'!C199,'Order Form'!D199) & \"\"","v":""},{"$f":"'Order Form'!E199 & \"\"","v":""},{"$f":"'Order Form'!F199","v":0},{"$f":"'Order Form'!I199","v":0},{"$f":"'Order Form'!G199","v":0},{"$f":"'Order Form'!H199","v":0},{"$f":"'Order Form'!J199 & \"\"","v":""},{"$f":"'Order Form'!L199 & \"\"","v":""},{"$f":"'Order Form'!C199 & \"\"","v":""},{"$f":"'Order Form'!K199 & \"\"","v":""},{"$f":"'Order Form'!$E$14","v":"YES"},{"$f":"'Order Form'!$E$19","v":0},{"$f":"'Order Form'!$E$16","v":"FREE gift card"},{"$f":"'Order Form'!$E$17","v":"No thanks"},"No","No",{"$f":"\"Dispatch Week: \"&'Order Form'!$E$18","v":"Dispatch Week: "},{"$f":"\"VIP: \"&'Order Form'!$E$5 &\"; Rib: \"&'Order Form'!$E$17 &\"; GT: \"&'Order Form'!$E$16","v":"VIP: ; Rib: No thanks; GT: FREE gift card"},null,null,null,{"$f":"IF(P179=\"\",\"\",IFERROR(INDIRECT(\"Postcodes!$C\"&SUMPRODUCT(--(Postcodes!$A$2:$A$100<=P179)*(Postcodes!$B$2:$B$100>=P179), ROW(Postcodes!$A$2:$A$100))),\"WRONG CODE\"))","v":0},null,null,null,null,null,null,""]
[{"$f":"'Order Form'!A200","v":179},{"$f":"'Order Form'!M200","v":""},{"$f":"'Order Form'!$E$4","v":0},{"$f":"'Order Form'!$E$5","v":0},{"$f":"'Order Form'!$E$6","v":0},{"$f":"'Order Form'!$E$7","v":0},{"$f":"'Order Form'!$E$9","v":0},{"$f":"'Order Form'!$E$8","v":0},{"$f":"'Order Form'!$E$10","v":0},{"$f":"'Order Form'!$E$11","v":0},{"$f":"IF(('Order Form'!$E$15=\"YES\"),'Order Form'!$E$12,\"\")","v":0},{"$f":"'Order Form'!$E$13 & \"\"","v":""},{"$f":"IF('Order Form'!D200=\"\",'Order Form'!C200,'Order Form'!D200) & \"\"","v":""},{"$f":"'Order Form'!E200 & \"\"","v":""},{"$f":"'Order Form'!F200","v":0},{"$f":"'Order Form'!I200","v":0},{"$f":"'Order Form'!G200","v":0},{"$f":"'Order Form'!H200","v":0},{"$f":"'Order Form'!J200 & \"\"","v":""},{"$f":"'Order Form'!L200 & \"\"","v":""},{"$f":"'Order Form'!C200 & \"\"","v":""},{"$f":"'Order Form'!K200 & \"\"","v":""},{"$f":"'Order Form'!$E$14","v":"YES"},{"$f":"'Order Form'!$E$19","v":0},{"$f":"'Order Form'!$E$16","v":"FREE gift card"},{"$f":"'Order Form'!$E$17","v":"No thanks"},"No","No",{"$f":"\"Dispatch Week: \"&'Order Form'!$E$18","v":"Dispatch Week: "},{"$f":"\"VIP: \"&'Order Form'!$E$5 &\"; Rib: \"&'Order Form'!$E$17 &\"; GT: \"&'Order Form'!$E$16","v":"VIP: ; Rib: No thanks; GT: FREE gift card"},null,null,null,{"$f":"IF(P180=\"\",\"\",IFERROR(INDIRECT(\"Postcodes!$C\"&SUMPRODUCT(--(Postcodes!$A$2:$A$100<=P180)*(Postcodes!$B$2:$B$100>=P180), ROW(Postcodes!$A$2:$A$100))),\"WRONG CODE\"))","v":0},null,null,null,null,null,null,""]
[{"$f":"'Order Form'!A201","v":180},{"$f":"'Order Form'!M201","v":""},{"$f":"'Order Form'!$E$4","v":0},{"$f":"'Order Form'!$E$5","v":0},{"$f":"'Order Form'!$E$6","v":0},{"$f":"'Order Form'!$E$7","v":0},{"$f":"'Order Form'!$E$9","v":0},{"$f":"'Order Form'!$E$8","v":0},{"$f":"'Order Form'!$E$10","v":0},{"$f":"'Order Form'!$E$11","v":0},{"$f":"IF(('Order Form'!$E$15=\"YES\"),'Order Form'!$E$12,\"\")","v":0},{"$f":"'Order Form'!$E$13 & \"\"","v":""},{"$f":"IF('Order Form'!D201=\"\",'Order Form'!C201,'Order Form'!D201) & \"\"","v":""},{"$f":"'Order Form'!E201 & \"\"","v":""},{"$f":"'Order Form'!F201","v":0},{"$f":"'Order Form'!I201","v":0},{"$f":"'Order Form'!G201","v":0},{"$f":"'Order Form'!H201","v":0},{"$f":"'Order Form'!J201 & \"\"","v":""},{"$f":"'Order Form'!L201 & \"\"","v":""},{"$f":"'Order Form'!C201 & \"\"","v":""},{"$f":"'Order Form'!K201 & \"\"","v":""},{"$f":"'Order Form'!$E$14","v":"YES"},{"$f":"'Order Form'!$E$19","v":0},{"$f":"'Order Form'!$E$16","v":"FREE gift card"},{"$f":"'Order Form'!$E$17","v":"No thanks"},"No","No",{"$f":"\"Dispatch Week: \"&'Order Form'!$E$18","v":"Dispatch Week: "},{"$f":"\"VIP: \"&'Order Form'!$E$5 &\"; Rib: \"&'Order Form'!$E$17 &\"; GT: \"&'Order Form'!$E$16","v":"VIP: ; Rib: No thanks; GT: FREE gift card"},null,null,null,{"$f":"IF(P181=\"\",\"\",IFERROR(INDIRECT(\"Postcodes!$C\"&SUMPRODUCT(--(Postcodes!$A$2:$A$100<=P181)*(Postcodes!$B$2:$B$100>=P181), ROW(Postcodes!$A$2:$A$100))),\"WRONG CODE\"))","v":0},null,null,null,null,null,null,""]
[{"$f":"'Order Form'!A202","v":181},{"$f":"'Order Form'!M202","v":""},{"$f":"'Order Form'!$E$4","v":0},{"$f":"'Order Form'!$E$5","v":0},{"$f":"'Order Form'!$E$6","v":0},{"$f":"'Order Form'!$E$7","v":0},{"$f":"'Order Form'!$E$9","v":0},{"$f":"'Order Form'!$E$8","v":0},{"$f":"'Order Form'!$E$10","v":0},{"$f":"'Order Form'!$E$11","v":0},{"$f":"IF(('Order Form'!$E$15=\"YES\"),'Order Form'!$E$12,\"\")","v":0},{"$f":"'Order Form'!$E$13 & \"\"","v":""},{"$f":"IF('Order Form'!D202=\"\",'Order Form'!C202,'Order Form'!D202) & \"\"","v":""},{"$f":"'Order Form'!E202 & \"\"","v":""},{"$f":"'Order Form'!F202","v":0},{"$f":"'Order Form'!I202","v":0},{"$f":"'Order Form'!G202","v":0},{"$f":"'Order Form'!H202","v":0},{"$f":"'Order Form'!J202 & \"\"","v":""},{"$f":"'Order Form'!L202 & \"\"","v":""},{"$f":"'Order Form'!C202 & \"\"","v":""},{"$f":"'Order Form'!K202 & \"\"","v":""},{"$f":"'Order Form'!$E$14","v":"YES"},{"$f":"'Order Form'!$E$19","v":0},{"$f":"'Order Form'!$E$16","v":"FREE gift card"},{"$f":"'Order Form'!$E$17","v":"No thanks"},"No","No",{"$f":"\"Dispatch Week: \"&'Order Form'!$E$18","v":"Dispatch Week: "},{"$f":"\"VIP: \"&'Order Form'!$E$5 &\"; Rib: \"&'Order Form'!$E$17 &\"; GT: \"&'Order Form'!$E$16","v":"VIP: ; Rib: No thanks; GT: FREE gift card"},null,null,null,{"$f":"IF(P182=\"\",\"\",IFERROR(INDIRECT(\"Postcodes!$C\"&SUMPRODUCT(--(Postcodes!$A$2:$A$100<=P182)*(Postcodes!$B$2:$B$100>=P182), ROW(Postcodes!$A$2:$A$100))),\"WRONG CODE\"))","v":0},null,null,null,null,null,null,""]
[{"$f":"'Order Form'!A203","v":182},{"$f":"'Order Form'!M203","v":""},{"$f":"'Order Form'!$E$4","v":0},{"$f":"'Order Form'!$E$5","v":0},{"$f":"'Order Form'!$E$6","v":0},{"$f":"'Order Form'!$E$7","v":0},{"$f":"'Order Form'!$E$9","v":0},{"$f":"'Order Form'!$E$8","v":0},{"$f":"'Order Form'!$E$10","v":0},{"$f":"'Order Form'!$E$11","v":0},{"$f":"IF(('Order Form'!$E$15=\"YES\"),'Order Form'!$E$12,\"\")","v":0},{"$f":"'Order Form'!$E$13 & \"\"","v":""},{"$f":"IF('Order Form'!D203=\"\",'Order Form'!C203,'Order Form'!D203) & \"\"","v":""},{"$f":"'Order Form'!E203 & \"\"","v":""},{"$f":"'Order Form'!F203","v":0},{"$f":"'Order Form'!I203","v":0},{"$f":"'Order Form'!G203","v":0},{"$f":"'Order Form'!H203","v":0},{"$f":"'Order Form'!J203 & \"\"","v":""},{"$f":"'Order Form'!L203 & \"\"","v":""},{"$f":"'Order Form'!C203 & \"\"","v":""},{"$f":"'Order Form'!K203 & \"\"","v":""},{"$f":"'Order Form'!$E$14","v":"YES"},{"$f":"'Order Form'!$E$19","v":0},{"$f":"'Order Form'!$E$16","v":"FREE gift card"},{"$f":"'Order Form'!$E$17","v":"No thanks"},"No","No",{"$f":"\"Dispatch Week: \"&'Order Form'!$E$18","v":"Dispatch Week: "},{"$f":"\"VIP: \"&'Order Form'!$E$5 &\"; Rib: \"&'Order Form'!$E$17 &\"; GT: \"&'Order Form'!$E$16","v":"VIP: ; Rib: No thanks; GT: FREE gift card"},null,null,null,{"$f":"IF(P183=\"\",\"\",IFERROR(INDIRECT(\"Postcodes!$C\"&SUMPRODUCT(--(Postcodes!$A$2:$A$100<=P183)*(Postcodes!$B$2:$B$100>=P183), ROW(Postcodes!$A$2:$A$100))),\"WRONG CODE\"))","v":0},null,null,null,null,null,null,""]
[{"$f":"'Order Form'!A204","v":183},{"$f":"'Order Form'!M204","v":""},{"$f":"'Order Form'!$E$4","v":0},{"$f":"'Order Form'!$E$5","v":0},{"$f":"'Order Form'!$E$6","v":0},{"$f":"'Order Form'!$E$7","v":0},{"$f":"'Order Form'!$E$9","v":0},{"$f":"'Order Form'!$E$8","v":0},{"$f":"'Order Form'!$E$10","v":0},{"$f":"'Order Form'!$E$11","v":0},{"$f":"IF(('Order Form'!$E$15=\"YES\"),'Order Form'!$E$12,\"\")","v":0},{"$f":"'Order Form'!$E$13 & \"\"","v":""},{"$f":"IF('Order Form'!D204=\"\",'Order Form'!C204,'Order Form'!D204) & \"\"","v":""},{"$f":"'Order Form'!E204 & \"\"","v":""},{"$f":"'Order Form'!F204","v":0},{"$f":"'Order Form'!I204","v":0},{"$f":"'Order Form'!G204","v":0},{"$f":"'Order Form'!H204","v":0},{"$f":"'Order Form'!J204 & \"\"","v":""},{"$f":"'Order Form'!L204 & \"\"","v":""},{"$f":"'Order Form'!C204 & \"\"","v":""},{"$f":"'Order Form'!K204 & \"\"","v":""},{"$f":"'Order Form'!$E$14","v":"YES"},{"$f":"'Order Form'!$E$19","v":0},{"$f":"'Order Form'!$E$16","v":"FREE gift card"},{"$f":"'Order Form'!$E$17","v":"No thanks"},"No","No",{"$f":"\"Dispatch Week: \"&'Order Form'!$E$18","v":"Dispatch Week: "},{"$f":"\"VIP: \"&'Order Form'!$E$5 &\"; Rib: \"&'Order Form'!$E$17 &\"; GT: \"&'Order Form'!$E$16","v":"VIP: ; Rib: No thanks; GT: FREE gift card"},null,null,null,{"$f":"IF(P184=\"\",\"\",IFERROR(INDIRECT(\"Postcodes!$C\"&SUMPRODUCT(--(Postcodes!$A$2:$A$100<=P184)*(Postcodes!$B$2:$B$100>=P184), ROW(Postcodes!$A$2:$A$100))),\"WRONG CODE\"))","v":0},null,null,null,null,null,null,""]
[{"$f":"'Order Form'!A205","v":184},{"$f":"'Order Form'!M205","v":""},{"$f":"'Order Form'!$E$4","v":0},{"$f":"'Order Form'!$E$5","v":0},{"$f":"'Order Form'!$E$6","v":0},{"$f":"'Order Form'!$E$7","v":0},{"$f":"'Order Form'!$E$9","v":0},{"$f":"'Order Form'!$E$8","v":0},{"$f":"'Order Form'!$E$10","v":0},{"$f":"'Order Form'!$E$11","v":0},{"$f":"IF(('Order Form'!$E$15=\"YES\"),'Order Form'!$E$12,\"\")","v":0},{"$f":"'Order Form'!$E$13 & \"\"","v":""},{"$f":"IF('Order Form'!D205=\"\",'Order Form'!C205,'Order Form'!D205) & \"\"","v":""},{"$f":"'Order Form'!E205 & \"\"","v":""},{"$f":"'Order Form'!F205","v":0},{"$f":"'Order Form'!I205","v":0},{"$f":"'Order Form'!G205","v":0},{"$f":"'Order Form'!H205","v":0},{"$f":"'Order Form'!J205 & \"\"","v":""},{"$f":"'Order Form'!L205 & \"\"","v":""},{"$f":"'Order Form'!C205 & \"\"","v":""},{"$f":"'Order Form'!K205 & \"\"","v":""},{"$f":"'Order Form'!$E$14","v":"YES"},{"$f":"'Order Form'!$E$19","v":0},{"$f":"'Order Form'!$E$16","v":"FREE gift card"},{"$f":"'Order Form'!$E$17","v":"No thanks"},"No","No",{"$f":"\"Dispatch Week: \"&'Order Form'!$E$18","v":"Dispatch Week: "},{"$f":"\"VIP: \"&'Order Form'!$E$5 &\"; Rib: \"&'Order Form'!$E$17 &\"; GT: \"&'Order Form'!$E$16","v":"VIP: ; Rib: No thanks; GT: FREE gift card"},null,null,null,{"$f":"IF(P185=\"\",\"\",IFERROR(INDIRECT(\"Postcodes!$C\"&SUMPRODUCT(--(Postcodes!$A$2:$A$100<=P185)*(Postcodes!$B$2:$B$100>=P185), ROW(Postcodes!$A$2:$A$100))),\"WRONG CODE\"))","v":0},null,null,null,null,null,null,""]
[{"$f":"'Order Form'!A206","v":185},{"$f":"'Order Form'!M206","v":""},{"$f":"'Order Form'!$E$4","v":0},{"$f":"'Order Form'!$E$5","v":0},{"$f":"'Order Form'!$E$6","v":0},{"$f":"'Order Form'!$E$7","v":0},{"$f":"'Order Form'!$E$9","v":0},{"$f":"'Order Form'!$E$8","v":0},{"$f":"'Order Form'!$E$10","v":0},{"$f":"'Order Form'!$E$11","v":0},{"$f":"IF(('Order Form'!$E$15=\"YES\"),'Order Form'!$E$12,\"\")","v":0},{"$f":"'Order Form'!$E$13 & \"\"","v":""},{"$f":"IF('Order Form'!D206=\"\",'Order Form'!C206,'Order Form'!D206) & \"\"","v":""},{"$f":"'Order Form'!E206 & \"\"","v":""},{"$f":"'Order Form'!F206","v":0},{"$f":"'Order Form'!I206","v":0},{"$f":"'Order Form'!G206","v":0},{"$f":"'Order Form'!H206","v":0},{"$f":"'Order Form'!J206 & \"\"","v":""},{"$f":"'Order Form'!L206 & \"\"","v":""},{"$f":"'Order Form'!C206 & \"\"","v":""},{"$f":"'Order Form'!K206 & \"\"","v":""},{"$f":"'Order Form'!$E$14","v":"YES"},{"$f":"'Order Form'!$E$19","v":0},{"$f":"'Order Form'!$E$16","v":"FREE gift card"},{"$f":"'Order Form'!$E$17","v":"No thanks"},"No","No",{"$f":"\"Dispatch Week: \"&'Order Form'!$E$18","v":"Dispatch Week: "},{"$f":"\"VIP: \"&'Order Form'!$E$5 &\"; Rib: \"&'Order Form'!$E$17 &\"; GT: \"&'Order Form'!$E$16","v":"VIP: ; Rib: No thanks; GT: FREE gift card"},null,null,null,{"$f":"IF(P186=\"\",\"\",IFERROR(INDIRECT(\"Postcodes!$C\"&SUMPRODUCT(--(Postcodes!$A$2:$A$100<=P186)*(Postcodes!$B$2:$B$100>=P186), ROW(Postcodes!$A$2:$A$100))),\"WRONG CODE\"))","v":0},null,null,null,null,null,null,""]
[{"$f":"'Order Form'!A207","v":186},{"$f":"'Order Form'!M207","v":""},{"$f":"'Order Form'!$E$4","v":0},{"$f":"'Order Form'!$E$5","v":0},{"$f":"'Order Form'!$E$6","v":0},{"$f":"'Order Form'!$E$7","v":0},{"$f":"'Order Form'!$E$9","v":0},{"$f":"'Order Form'!$E$8","v":0},{"$f":"'Order Form'!$E$10","v":0},{"$f":"'Order Form'!$E$11","v":0},{"$f":"IF(('Order Form'!$E$15=\"YES\"),'Order Form'!$E$12,\"\")","v":0},{"$f":"'Order Form'!$E$13 & \"\"","v":""},{"$f":"IF('Order Form'!D207=\"\",'Order Form'!C207,'Order Form'!D207) & \"\"","v":""},{"$f":"'Order Form'!E207 & \"\"","v":""},{"$f":"'Order Form'!F207","v":0},{"$f":"'Order Form'!I207","v":0},{"$f":"'Order Form'!G207","v":0},{"$f":"'Order Form'!H207","v":0},{"$f":"'Order Form'!J207 & \"\"","v":""},{"$f":"'Order Form'!L207 & \"\"","v":""},{"$f":"'Order Form'!C207 & \"\"","v":""},{"$f":"'Order Form'!K207 & \"\"","v":""},{"$f":"'Order Form'!$E$14","v":"YES"},{"$f":"'Order Form'!$E$19","v":0},{"$f":"'Order Form'!$E$16","v":"FREE gift card"},{"$f":"'Order Form'!$E$17","v":"No thanks"},"No","No",{"$f":"\"Dispatch Week: \"&'Order Form'!$E$18","v":"Dispatch Week: "},{"$f":"\"VIP: \"&'Order Form'!$E$5 &\"; Rib: \"&'Order Form'!$E$17 &\"; GT: \"&'Order Form'!$E$16","v":"VIP: ; Rib: No thanks; GT: FREE gift card"},null,null,null,{"$f":"IF(P187=\"\",\"\",IFERROR(INDIRECT(\"Postcodes!$C\"&SUMPRODUCT(--(Postcodes!$A$2:$A$100<=P187)*(Postcodes!$B$2:$B$100>=P187), ROW(Postcodes!$A$2:$A$100))),\"WRONG CODE\"))","v":0},null,null,null,null,null,null,""]
[{"$f":"'Order Form'!A208","v":187},{"$f":"'Order Form'!M208","v":""},{"$f":"'Order Form'!$E$4","v":0},{"$f":"'Order Form'!$E$5","v":0},{"$f":"'Order Form'!$E$6","v":0},{"$f":"'Order Form'!$E$7","v":0},{"$f":"'Order Form'!$E$9","v":0},{"$f":"'Order Form'!$E$8","v":0},{"$f":"'Order Form'!$E$10","v":0},{"$f":"'Order Form'!$E$11","v":0},{"$f":"IF(('Order Form'!$E$15=\"YES\"),'Order Form'!$E$12,\"\")","v":0},{"$f":"'Order Form'!$E$13 & \"\"","v":""},{"$f":"IF('Order Form'!D208=\"\",'Order Form'!C208,'Order Form'!D208) & \"\"","v":""},{"$f":"'Order Form'!E208 & \"\"","v":""},{"$f":"'Order Form'!F208","v":0},{"$f":"'Order Form'!I208","v":0},{"$f":"'Order Form'!G208","v":0},{"$f":"'Order Form'!H208","v":0},{"$f":"'Order Form'!J208 & \"\"","v":""},{"$f":"'Order Form'!L208 & \"\"","v":""},{"$f":"'Order Form'!C208 & \"\"","v":""},{"$f":"'Order Form'!K208 & \"\"","v":""},{"$f":"'Order Form'!$E$14","v":"YES"},{"$f":"'Order Form'!$E$19","v":0},{"$f":"'Order Form'!$E$16","v":"FREE gift card"},{"$f":"'Order Form'!$E$17","v":"No thanks"},"No","No",{"$f":"\"Dispatch Week: \"&'Order Form'!$E$18","v":"Dispatch Week: "},{"$f":"\"VIP: \"&'Order Form'!$E$5 &\"; Rib: \"&'Order Form'!$E$17 &\"; GT: \"&'Order Form'!$E$16","v":"VIP: ; Rib: No thanks; GT: FREE gift card"},null,null,null,{"$f":"IF(P188=\"\",\"\",IFERROR(INDIRECT(\"Postcodes!$C\"&SUMPRODUCT(--(Postcodes!$A$2:$A$100<=P188)*(Postcodes!$B$2:$B$100>=P188), ROW(Postcodes!$A$2:$A$100))),\"WRONG CODE\"))","v":0},null,null,null,null,null,null,""]
[{"$f":"'Order Form'!A209","v":188},{"$f":"'Order Form'!M209","v":""},{"$f":"'Order Form'!$E$4","v":0},{"$f":"'Order Form'!$E$5","v":0},{"$f":"'Order Form'!$E$6","v":0},{"$f":"'Order Form'!$E$7","v":0},{"$f":"'Order Form'!$E$9","v":0},{"$f":"'Order Form'!$E$8","v":0},{"$f":"'Order Form'!$E$10","v":0},{"$f":"'Order Form'!$E$11","v":0},{"$f":"IF(('Order Form'!$E$15=\"YES\"),'Order Form'!$E$12,\"\")","v":0},{"$f":"'Order Form'!$E$13 & \"\"","v":""},{"$f":"IF('Order Form'!D209=\"\",'Order Form'!C209,'Order Form'!D209) & \"\"","v":""},{"$f":"'Order Form'!E209 & \"\"","v":""},{"$f":"'Order Form'!F209","v":0},{"$f":"'Order Form'!I209","v":0},{"$f":"'Order Form'!G209","v":0},{"$f":"'Order Form'!H209","v":0},{"$f":"'Order Form'!J209 & \"\"","v":""},{"$f":"'Order Form'!L209 & \"\"","v":""},{"$f":"'Order Form'!C209 & \"\"","v":""},{"$f":"'Order Form'!K209 & \"\"","v":""},{"$f":"'Order Form'!$E$14","v":"YES"},{"$f":"'Order Form'!$E$19","v":0},{"$f":"'Order Form'!$E$16","v":"FREE gift card"},{"$f":"'Order Form'!$E$17","v":"No thanks"},"No","No",{"$f":"\"Dispatch Week: \"&'Order Form'!$E$18","v":"Dispatch Week: "},{"$f":"\"VIP: \"&'Order Form'!$E$5 &\"; Rib: \"&'Order Form'!$E$17 &\"; GT: \"&'Order Form'!$E$16","v":"VIP: ; Rib: No thanks; GT: FREE gift card"},null,null,null,{"$f":"IF(P189=\"\",\"\",IFERROR(INDIRECT(\"Postcodes!$C\"&SUMPRODUCT(--(Postcodes!$A$2:$A$100<=P189)*(Postcodes!$B$2:$B$100>=P189), ROW(Postcodes!$A$2:$A$100))),\"WRONG CODE\"))","v":0},null,null,null,null,null,null,""]
[{"$f":"'Order Form'!A210","v":189},{"$f":"'Order Form'!M210","v":""},{"$f":"'Order Form'!$E$4","v":0},{"$f":"'Order Form'!$E$5","v":0},{"$f":"'Order Form'!$E$6","v":0},{"$f":"'Order Form'!$E$7","v":0},{"$f":"'Order Form'!$E$9","v":0},{"$f":"'Order Form'!$E$8","v":0},{"$f":"'Order Form'!$E$10","v":0},{"$f":"'Order Form'!$E$11","v":0},{"$f":"IF(('Order Form'!$E$15=\"YES\"),'Order Form'!$E$12,\"\")","v":0},{"$f":"'Order Form'!$E$13 & \"\"","v":""},{"$f":"IF('Order Form'!D210=\"\",'Order Form'!C210,'Order Form'!D210) & \"\"","v":""},{"$f":"'Order Form'!E210 & \"\"","v":""},{"$f":"'Order Form'!F210","v":0},{"$f":"'Order Form'!I210","v":0},{"$f":"'Order Form'!G210","v":0},{"$f":"'Order Form'!H210","v":0},{"$f":"'Order Form'!J210 & \"\"","v":""},{"$f":"'Order Form'!L210 & \"\"","v":""},{"$f":"'Order Form'!C210 & \"\"","v":""},{"$f":"'Order Form'!K210 & \"\"","v":""},{"$f":"'Order Form'!$E$14","v":"YES"},{"$f":"'Order Form'!$E$19","v":0},{"$f":"'Order Form'!$E$16","v":"FREE gift card"},{"$f":"'Order Form'!$E$17","v":"No thanks"},"No","No",{"$f":"\"Dispatch Week: \"&'Order Form'!$E$18","v":"Dispatch Week: "},{"$f":"\"VIP: \"&'Order Form'!$E$5 &\"; Rib: \"&'Order Form'!$E$17 &\"; GT: \"&'Order Form'!$E$16","v":"VIP: ; Rib: No thanks; GT: FREE gift card"},null,null,null,{"$f":"IF(P190=\"\",\"\",IFERROR(INDIRECT(\"Postcodes!$C\"&SUMPRODUCT(--(Postcodes!$A$2:$A$100<=P190)*(Postcodes!$B$2:$B$100>=P190), ROW(Postcodes!$A$2:$A$100))),\"WRONG CODE\"))","v":0},null,null,null,null,null,null,""]
[{"$f":"'Order Form'!A211","v":190},{"$f":"'Order Form'!M211","v":""},{"$f":"'Order Form'!$E$4","v":0},{"$f":"'Order Form'!$E$5","v":0},{"$f":"'Order Form'!$E$6","v":0},{"$f":"'Order Form'!$E$7","v":0},{"$f":"'Order Form'!$E$9","v":0},{"$f":"'Order Form'!$E$8","v":0},{"$f":"'Order Form'!$E$10","v":0},{"$f":"'Order Form'!$E$11","v":0},{"$f":"IF(('Order Form'!$E$15=\"YES\"),'Order Form'!$E$12,\"\")","v":0},{"$f":"'Order Form'!$E$13 & \"\"","v":""},{"$f":"IF('Order Form'!D211=\"\",'Order Form'!C211,'Order Form'!D211) & \"\"","v":""},{"$f":"'Order Form'!E211 & \"\"","v":""},{"$f":"'Order Form'!F211","v":0},{"$f":"'Order Form'!I211","v":0},{"$f":"'Order Form'!G211","v":0},{"$f":"'Order Form'!H211","v":0},{"$f":"'Order Form'!J211 & \"\"","v":""},{"$f":"'Order Form'!L211 & \"\"","v":""},{"$f":"'Order Form'!C211 & \"\"","v":""},{"$f":"'Order Form'!K211 & \"\"","v":""},{"$f":"'Order Form'!$E$14","v":"YES"},{"$f":"'Order Form'!$E$19","v":0},{"$f":"'Order Form'!$E$16","v":"FREE gift card"},{"$f":"'Order Form'!$E$17","v":"No thanks"},"No","No",{"$f":"\"Dispatch Week: \"&'Order Form'!$E$18","v":"Dispatch Week: "},{"$f":"\"VIP: \"&'Order Form'!$E$5 &\"; Rib: \"&'Order Form'!$E$17 &\"; GT: \"&'Order Form'!$E$16","v":"VIP: ; Rib: No thanks; GT: FREE gift card"},null,null,null,{"$f":"IF(P191=\"\",\"\",IFERROR(INDIRECT(\"Postcodes!$C\"&SUMPRODUCT(--(Postcodes!$A$2:$A$100<=P191)*(Postcodes!$B$2:$B$100>=P191), ROW(Postcodes!$A$2:$A$100))),\"WRONG CODE\"))","v":0},null,null,null,null,null,null,""]
[{"$f":"'Order Form'!A212","v":191},{"$f":"'Order Form'!M212","v":""},{"$f":"'Order Form'!$E$4","v":0},{"$f":"'Order Form'!$E$5","v":0},{"$f":"'Order Form'!$E$6","v":0},{"$f":"'Order Form'!$E$7","v":0},{"$f":"'Order Form'!$E$9","v":0},{"$f":"'Order Form'!$E$8","v":0},{"$f":"'Order Form'!$E$10","v":0},{"$f":"'Order Form'!$E$11","v":0},{"$f":"IF(('Order Form'!$E$15=\"YES\"),'Order Form'!$E$12,\"\")","v":0},{"$f":"'Order Form'!$E$13 & \"\"","v":""},{"$f":"IF('Order Form'!D212=\"\",'Order Form'!C212,'Order Form'!D212) & \"\"","v":""},{"$f":"'Order Form'!E212 & \"\"","v":""},{"$f":"'Order Form'!F212","v":0},{"$f":"'Order Form'!I212","v":0},{"$f":"'Order Form'!G212","v":0},{"$f":"'Order Form'!H212","v":0},{"$f":"'Order Form'!J212 & \"\"","v":""},{"$f":"'Order Form'!L212 & \"\"","v":""},{"$f":"'Order Form'!C212 & \"\"","v":""},{"$f":"'Order Form'!K212 & \"\"","v":""},{"$f":"'Order Form'!$E$14","v":"YES"},{"$f":"'Order Form'!$E$19","v":0},{"$f":"'Order Form'!$E$16","v":"FREE gift card"},{"$f":"'Order Form'!$E$17","v":"No thanks"},"No","No",{"$f":"\"Dispatch Week: \"&'Order Form'!$E$18","v":"Dispatch Week: "},{"$f":"\"VIP: \"&'Order Form'!$E$5 &\"; Rib: \"&'Order Form'!$E$17 &\"; GT: \"&'Order Form'!$E$16","v":"VIP: ; Rib: No thanks; GT: FREE gift card"},null,null,null,{"$f":"IF(P192=\"\",\"\",IFERROR(INDIRECT(\"Postcodes!$C\"&SUMPRODUCT(--(Postcodes!$A$2:$A$100<=P192)*(Postcodes!$B$2:$B$100>=P192), ROW(Postcodes!$A$2:$A$100))),\"WRONG CODE\"))","v":0},null,null,null,null,null,null,""]
[{"$f":"'Order Form'!A213","v":192},{"$f":"'Order Form'!M213","v":""},{"$f":"'Order Form'!$E$4","v":0},{"$f":"'Order Form'!$E$5","v":0},{"$f":"'Order Form'!$E$6","v":0},{"$f":"'Order Form'!$E$7","v":0},{"$f":"'Order Form'!$E$9","v":0},{"$f":"'Order Form'!$E$8","v":0},{"$f":"'Order Form'!$E$10","v":0},{"$f":"'Order Form'!$E$11","v":0},{"$f":"IF(('Order Form'!$E$15=\"YES\"),'Order Form'!$E$12,\"\")","v":0},{"$f":"'Order Form'!$E$13 & \"\"","v":""},{"$f":"IF('Order Form'!D213=\"\",'Order Form'!C213,'Order Form'!D213) & \"\"","v":""},{"$f":"'Order Form'!E213 & \"\"","v":""},{"$f":"'Order Form'!F213","v":0},{"$f":"'Order Form'!I213","v":0},{"$f":"'Order Form'!G213","v":0},{"$f":"'Order Form'!H213","v":0},{"$f":"'Order Form'!J213 & \"\"","v":""},{"$f":"'Order Form'!L213 & \"\"","v":""},{"$f":"'Order Form'!C213 & \"\"","v":""},{"$f":"'Order Form'!K213 & \"\"","v":""},{"$f":"'Order Form'!$E$14","v":"YES"},{"$f":"'Order Form'!$E$19","v":0},{"$f":"'Order Form'!$E$16","v":"FREE gift card"},{"$f":"'Order Form'!$E$17","v":"No thanks"},"No","No",{"$f":"\"Dispatch Week: \"&'Order Form'!$E$18","v":"Dispatch Week: "},{"$f":"\"VIP: \"&'Order Form'!$E$5 &\"; Rib: \"&'Order Form'!$E$17 &\"; GT: \"&'Order Form'!$E$16","v":"VIP: ; Rib: No thanks; GT: FREE gift card"},null,null,null,{"$f":"IF(P193=\"\",\"\",IFERROR(INDIRECT(\"Postcodes!$C\"&SUMPRODUCT(--(Postcodes!$A$2:$A$100<=P193)*(Postcodes!$B$2:$B$100>=P193), ROW(Postcodes!$A$2:$A$100))),\"WRONG CODE\"))","v":0},null,null,null,null,null,null,""]
[{"$f":"'Order Form'!A214","v":193},{"$f":"'Order Form'!M214","v":""},{"$f":"'Order Form'!$E$4","v":0},{"$f":"'Order Form'!$E$5","v":0},{"$f":"'Order Form'!$E$6","v":0},{"$f":"'Order Form'!$E$7","v":0},{"$f":"'Order Form'!$E$9","v":0},{"$f":"'Order Form'!$E$8","v":0},{"$f":"'Order Form'!$E$10","v":0},{"$f":"'Order Form'!$E$11","v":0},{"$f":"IF(('Order Form'!$E$15=\"YES\"),'Order Form'!$E$12,\"\")","v":0},{"$f":"'Order Form'!$E$13 & \"\"","v":""},{"$f":"IF('Order Form'!D214=\"\",'Order Form'!C214,'Order Form'!D214) & \"\"","v":""},{"$f":"'Order Form'!E214 & \"\"","v":""},{"$f":"'Order Form'!F214","v":0},{"$f":"'Order Form'!I214","v":0},{"$f":"'Order Form'!G214","v":0},{"$f":"'Order Form'!H214","v":0},{"$f":"'Order Form'!J214 & \"\"","v":""},{"$f":"'Order Form'!L214 & \"\"","v":""},{"$f":"'Order Form'!C214 & \"\"","v":""},{"$f":"'Order Form'!K214 & \"\"","v":""},{"$f":"'Order Form'!$E$14","v":"YES"},{"$f":"'Order Form'!$E$19","v":0},{"$f":"'Order Form'!$E$16","v":"FREE gift card"},{"$f":"'Order Form'!$E$17","v":"No thanks"},"No","No",{"$f":"\"Dispatch Week: \"&'Order Form'!$E$18","v":"Dispatch Week: "},{"$f":"\"VIP: \"&'Order Form'!$E$5 &\"; Rib: \"&'Order Form'!$E$17 &\"; GT: \"&'Order Form'!$E$16","v":"VIP: ; Rib: No thanks; GT: FREE gift card"},null,null,null,{"$f":"IF(P194=\"\",\"\",IFERROR(INDIRECT(\"Postcodes!$C\"&SUMPRODUCT(--(Postcodes!$A$2:$A$100<=P194)*(Postcodes!$B$2:$B$100>=P194), ROW(Postcodes!$A$2:$A$100))),\"WRONG CODE\"))","v":0},null,null,null,null,null,null,""]
[{"$f":"'Order Form'!A215","v":194},{"$f":"'Order Form'!M215","v":""},{"$f":"'Order Form'!$E$4","v":0},{"$f":"'Order Form'!$E$5","v":0},{"$f":"'Order Form'!$E$6","v":0},{"$f":"'Order Form'!$E$7","v":0},{"$f":"'Order Form'!$E$9","v":0},{"$f":"'Order Form'!$E$8","v":0},{"$f":"'Order Form'!$E$10","v":0},{"$f":"'Order Form'!$E$11","v":0},{"$f":"IF(('Order Form'!$E$15=\"YES\"),'Order Form'!$E$12,\"\")","v":0},{"$f":"'Order Form'!$E$13 & \"\"","v":""},{"$f":"IF('Order Form'!D215=\"\",'Order Form'!C215,'Order Form'!D215) & \"\"","v":""},{"$f":"'Order Form'!E215 & \"\"","v":""},{"$f":"'Order Form'!F215","v":0},{"$f":"'Order Form'!I215","v":0},{"$f":"'Order Form'!G215","v":0},{"$f":"'Order Form'!H215","v":0},{"$f":"'Order Form'!J215 & \"\"","v":""},{"$f":"'Order Form'!L215 & \"\"","v":""},{"$f":"'Order Form'!C215 & \"\"","v":""},{"$f":"'Order Form'!K215 & \"\"","v":""},{"$f":"'Order Form'!$E$14","v":"YES"},{"$f":"'Order Form'!$E$19","v":0},{"$f":"'Order Form'!$E$16","v":"FREE gift card"},{"$f":"'Order Form'!$E$17","v":"No thanks"},{"$f":"IF(OR(Y195=\"FREE gift card\",Y195=\"No Cards\"),\"No\",\"Yes\")","v":"No"},{"$f":"IF($Z$2=\"No thanks\",\"No\",\"Yes\")","v":"No"},{"$f":"\"Dispatch Week: \"&'Order Form'!$E$18","v":"Dispatch Week: "},{"$f":"\"VIP: \"&'Order Form'!$E$5 &\"; Rib: \"&'Order Form'!$E$17 &\"; GT: \"&'Order Form'!$E$16","v":"VIP: ; Rib: No thanks; GT: FREE gift card"},null,null,null,{"$f":"IF(P195=\"\",\"\",IFERROR(INDIRECT(\"Postcodes!$C\"&SUMPRODUCT(--(Postcodes!$A$2:$A$100<=P195)*(Postcodes!$B$2:$B$100>=P195), ROW(Postcodes!$A$2:$A$100))),\"WRONG CODE\"))","v":0},null,null,null,null,null,null,{"$f":"IF(AND(X195=\"ASAP\",Y195=\"FREE gift card\",Z195=\"No Thanks\"),\"asap\",\"\")","v":""}]
[{"$f":"'Order Form'!A216","v":195},{"$f":"'Order Form'!M216","v":""},{"$f":"'Order Form'!$E$4","v":0},{"$f":"'Order Form'!$E$5","v":0},{"$f":"'Order Form'!$E$6","v":0},{"$f":"'Order Form'!$E$7","v":0},{"$f":"'Order Form'!$E$9","v":0},{"$f":"'Order Form'!$E$8","v":0},{"$f":"'Order Form'!$E$10","v":0},{"$f":"'Order Form'!$E$11","v":0},{"$f":"IF(('Order Form'!$E$15=\"YES\"),'Order Form'!$E$12,\"\")","v":0},{"$f":"'Order Form'!$E$13 & \"\"","v":""},{"$f":"IF('Order Form'!D216=\"\",'Order Form'!C216,'Order Form'!D216) & \"\"","v":""},{"$f":"'Order Form'!E216 & \"\"","v":""},{"$f":"'Order Form'!F216","v":0},{"$f":"'Order Form'!I216","v":0},{"$f":"'Order Form'!G216","v":0},{"$f":"'Order Form'!H216","v":0},{"$f":"'Order Form'!J216 & \"\"","v":""},{"$f":"'Order Form'!L216 & \"\"","v":""},{"$f":"'Order Form'!C216 & \"\"","v":""},{"$f":"'Order Form'!K216 & \"\"","v":""},{"$f":"'Order Form'!$E$14","v":"YES"},{"$f":"'Order Form'!$E$19","v":0},{"$f":"'Order Form'!$E$16","v":"FREE gift card"},{"$f":"'Order Form'!$E$17","v":"No thanks"},"No","No",{"$f":"\"Dispatch Week: \"&'Order Form'!$E$18","v":"Dispatch Week: "},{"$f":"\"VIP: \"&'Order Form'!$E$5 &\"; Rib: \"&'Order Form'!$E$17 &\"; GT: \"&'Order Form'!$E$16","v":"VIP: ; Rib: No thanks; GT: FREE gift card"},null,null,null,{"$f":"IF(P196=\"\",\"\",IFERROR(INDIRECT(\"Postcodes!$C\"&SUMPRODUCT(--(Postcodes!$A$2:$A$100<=P196)*(Postcodes!$B$2:$B$100>=P196), ROW(Postcodes!$A$2:$A$100))),\"WRONG CODE\"))","v":0},null,null,null,null,null,null,""]
[{"$f":"'Order Form'!A217","v":196},{"$f":"'Order Form'!M217","v":""},{"$f":"'Order Form'!$E$4","v":0},{"$f":"'Order Form'!$E$5","v":0},{"$f":"'Order Form'!$E$6","v":0},{"$f":"'Order Form'!$E$7","v":0},{"$f":"'Order Form'!$E$9","v":0},{"$f":"'Order Form'!$E$8","v":0},{"$f":"'Order Form'!$E$10","v":0},{"$f":"'Order Form'!$E$11","v":0},{"$f":"IF(('Order Form'!$E$15=\"YES\"),'Order Form'!$E$12,\"\")","v":0},{"$f":"'Order Form'!$E$13 & \"\"","v":""},{"$f":"IF('Order Form'!D217=\"\",'Order Form'!C217,'Order Form'!D217) & \"\"","v":""},{"$f":"'Order Form'!E217 & \"\"","v":""},{"$f":"'Order Form'!F217","v":0},{"$f":"'Order Form'!I217","v":0},{"$f":"'Order Form'!G217","v":0},{"$f":"'Order Form'!H217","v":0},{"$f":"'Order Form'!J217 & \"\"","v":""},{"$f":"'Order Form'!L217 & \"\"","v":""},{"$f":"'Order Form'!C217 & \"\"","v":""},{"$f":"'Order Form'!K217 & \"\"","v":""},{"$f":"'Order Form'!$E$14","v":"YES"},{"$f":"'Order Form'!$E$19","v":0},{"$f":"'Order Form'!$E$16","v":"FREE gift card"},{"$f":"'Order Form'!$E$17","v":"No thanks"},"No","No",{"$f":"\"Dispatch Week: \"&'Order Form'!$E$18","v":"Dispatch Week: "},{"$f":"\"VIP: \"&'Order Form'!$E$5 &\"; Rib: \"&'Order Form'!$E$17 &\"; GT: \"&'Order Form'!$E$16","v":"VIP: ; Rib: No thanks; GT: FREE gift card"},null,null,null,{"$f":"IF(P197=\"\",\"\",IFERROR(INDIRECT(\"Postcodes!$C\"&SUMPRODUCT(--(Postcodes!$A$2:$A$100<=P197)*(Postcodes!$B$2:$B$100>=P197), ROW(Postcodes!$A$2:$A$100))),\"WRONG CODE\"))","v":0},null,null,null,null,null,null,""]
[{"$f":"'Order Form'!A218","v":197},{"$f":"'Order Form'!M218","v":""},{"$f":"'Order Form'!$E$4","v":0},{"$f":"'Order Form'!$E$5","v":0},{"$f":"'Order Form'!$E$6","v":0},{"$f":"'Order Form'!$E$7","v":0},{"$f":"'Order Form'!$E$9","v":0},{"$f":"'Order Form'!$E$8","v":0},{"$f":"'Order Form'!$E$10","v":0},{"$f":"'Order Form'!$E$11","v":0},{"$f":"IF(('Order Form'!$E$15=\"YES\"),'Order Form'!$E$12,\"\")","v":0},{"$f":"'Order Form'!$E$13 & \"\"","v":""},{"$f":"IF('Order Form'!D218=\"\",'Order Form'!C218,'Order Form'!D218) & \"\"","v":""},{"$f":"'Order Form'!E218 & \"\"","v":""},{"$f":"'Order Form'!F218","v":0},{"$f":"'Order Form'!I218","v":0},{"$f":"'Order Form'!G218","v":0},{"$f":"'Order Form'!H218","v":0},{"$f":"'Order Form'!J218 & \"\"","v":""},{"$f":"'Order Form'!L218 & \"\"","v":""},{"$f":"'Order Form'!C218 & \"\"","v":""},{"$f":"'Order Form'!K218 & \"\"","v":""},{"$f":"'Order Form'!$E$14","v":"YES"},{"$f":"'Order Form'!$E$19","v":0},{"$f":"'Order Form'!$E$16","v":"FREE gift card"},{"$f":"'Order Form'!$E$17","v":"No thanks"},"No","No",{"$f":"\"Dispatch Week: \"&'Order Form'!$E$18","v":"Dispatch Week: "},{"$f":"\"VIP: \"&'Order Form'!$E$5 &\"; Rib: \"&'Order Form'!$E$17 &\"; GT: \"&'Order Form'!$E$16","v":"VIP: ; Rib: No thanks; GT: FREE gift card"},null,null,null,{"$f":"IF(P198=\"\",\"\",IFERROR(INDIRECT(\"Postcodes!$C\"&SUMPRODUCT(--(Postcodes!$A$2:$A$100<=P198)*(Postcodes!$B$2:$B$100>=P198), ROW(Postcodes!$A$2:$A$100))),\"WRONG CODE\"))","v":0},null,null,null,null,null,null,""]
[{"$f":"'Order Form'!A219","v":198},{"$f":"'Order Form'!M219","v":""},{"$f":"'Order Form'!$E$4","v":0},{"$f":"'Order Form'!$E$5","v":0},{"$f":"'Order Form'!$E$6","v":0},{"$f":"'Order Form'!$E$7","v":0},{"$f":"'Order Form'!$E$9","v":0},{"$f":"'Order Form'!$E$8","v":0},{"$f":"'Order Form'!$E$10","v":0},{"$f":"'Order Form'!$E$11","v":0},{"$f":"IF(('Order Form'!$E$15=\"YES\"),'Order Form'!$E$12,\"\")","v":0},{"$f":"'Order Form'!$E$13 & \"\"","v":""},{"$f":"IF('Order Form'!D219=\"\",'Order Form'!C219,'Order Form'!D219) & \"\"","v":""},{"$f":"'Order Form'!E219 & \"\"","v":""},{"$f":"'Order Form'!F219","v":0},{"$f":"'Order Form'!I219","v":0},{"$f":"'Order Form'!G219","v":0},{"$f":"'Order Form'!H219","v":0},{"$f":"'Order Form'!J219 & \"\"","v":""},{"$f":"'Order Form'!L219 & \"\"","v":""},{"$f":"'Order Form'!C219 & \"\"","v":""},{"$f":"'Order Form'!K219 & \"\"","v":""},{"$f":"'Order Form'!$E$14","v":"YES"},{"$f":"'Order Form'!$E$19","v":0},{"$f":"'Order Form'!$E$16","v":"FREE gift card"},{"$f":"'Order Form'!$E$17","v":"No thanks"},"No","No",{"$f":"\"Dispatch Week: \"&'Order Form'!$E$18","v":"Dispatch Week: "},{"$f":"\"VIP: \"&'Order Form'!$E$5 &\"; Rib: \"&'Order Form'!$E$17 &\"; GT: \"&'Order Form'!$E$16","v":"VIP: ; Rib: No thanks; GT: FREE gift card"},null,null,null,{"$f":"IF(P199=\"\",\"\",IFERROR(INDIRECT(\"Postcodes!$C\"&SUMPRODUCT(--(Postcodes!$A$2:$A$100<=P199)*(Postcodes!$B$2:$B$100>=P199), ROW(Postcodes!$A$2:$A$100))),\"WRONG CODE\"))","v":0},null,null,null,null,null,null,""]
[{"$f":"'Order Form'!A220","v":199},{"$f":"'Order Form'!M220","v":""},{"$f":"'Order Form'!$E$4","v":0},{"$f":"'Order Form'!$E$5","v":0},{"$f":"'Order Form'!$E$6","v":0},{"$f":"'Order Form'!$E$7","v":0},{"$f":"'Order Form'!$E$9","v":0},{"$f":"'Order Form'!$E$8","v":0},{"$f":"'Order Form'!$E$10","v":0},{"$f":"'Order Form'!$E$11","v":0},{"$f":"IF(('Order Form'!$E$15=\"YES\"),'Order Form'!$E$12,\"\")","v":0},{"$f":"'Order Form'!$E$13 & \"\"","v":""},{"$f":"IF('Order Form'!D220=\"\",'Order Form'!C220,'Order Form'!D220) & \"\"","v":""},{"$f":"'Order Form'!E220 & \"\"","v":""},{"$f":"'Order Form'!F220","v":0},{"$f":"'Order Form'!I220","v":0},{"$f":"'Order Form'!G220","v":0},{"$f":"'Order Form'!H220","v":0},{"$f":"'Order Form'!J220 & \"\"","v":""},{"$f":"'Order Form'!L220 & \"\"","v":""},{"$f":"'Order Form'!C220 & \"\"","v":""},{"$f":"'Order Form'!K220 & \"\"","v":""},{"$f":"'Order Form'!$E$14","v":"YES"},{"$f":"'Order Form'!$E$19","v":0},{"$f":"'Order Form'!$E$16","v":"FREE gift card"},{"$f":"'Order Form'!$E$17","v":"No thanks"},"No","No",{"$f":"\"Dispatch Week: \"&'Order Form'!$E$18","v":"Dispatch Week: "},{"$f":"\"VIP: \"&'Order Form'!$E$5 &\"; Rib: \"&'Order Form'!$E$17 &\"; GT: \"&'Order Form'!$E$16","v":"VIP: ; Rib: No thanks; GT: FREE gift card"},null,null,null,{"$f":"IF(P200=\"\",\"\",IFERROR(INDIRECT(\"Postcodes!$C\"&SUMPRODUCT(--(Postcodes!$A$2:$A$100<=P200)*(Postcodes!$B$2:$B$100>=P200), ROW(Postcodes!$A$2:$A$100))),\"WRONG CODE\"))","v":0},null,null,null,null,null,null,""]
[{"$f":"'Order Form'!A221","v":200},{"$f":"'Order Form'!M221","v":""},{"$f":"'Order Form'!$E$4","v":0},{"$f":"'Order Form'!$E$5","v":0},{"$f":"'Order Form'!$E$6","v":0},{"$f":"'Order Form'!$E$7","v":0},{"$f":"'Order Form'!$E$9","v":0},{"$f":"'Order Form'!$E$8","v":0},{"$f":"'Order Form'!$E$10","v":0},{"$f":"'Order Form'!$E$11","v":0},{"$f":"IF(('Order Form'!$E$15=\"YES\"),'Order Form'!$E$12,\"\")","v":0},{"$f":"'Order Form'!$E$13 & \"\"","v":""},{"$f":"IF('Order Form'!D221=\"\",'Order Form'!C221,'Order Form'!D221) & \"\"","v":""},{"$f":"'Order Form'!E221 & \"\"","v":""},{"$f":"'Order Form'!F221","v":0},{"$f":"'Order Form'!I221","v":0},{"$f":"'Order Form'!G221","v":0},{"$f":"'Order Form'!H221","v":0},{"$f":"'Order Form'!J221 & \"\"","v":""},{"$f":"'Order Form'!L221 & \"\"","v":""},{"$f":"'Order Form'!C221 & \"\"","v":""},{"$f":"'Order Form'!K221 & \"\"","v":""},{"$f":"'Order Form'!$E$14","v":"YES"},{"$f":"'Order Form'!$E$19","v":0},{"$f":"'Order Form'!$E$16","v":"FREE gift card"},{"$f":"'Order Form'!$E$17","v":"No thanks"},"No","No",{"$f":"\"Dispatch Week: \"&'Order Form'!$E$18","v":"Dispatch Week: "},{"$f":"\"VIP: \"&'Order Form'!$E$5 &\"; Rib: \"&'Order Form'!$E$17 &\"; GT: \"&'Order Form'!$E$16","v":"VIP: ; Rib: No thanks; GT: FREE gift card"},null,null,null,{"$f":"IF(P201=\"\",\"\",IFERROR(INDIRECT(\"Postcodes!$C\"&SUMPRODUCT(--(Postcodes!$A$2:$A$100<=P201)*(Postcodes!$B$2:$B$100>=P201), ROW(Postcodes!$A$2:$A$100))),\"WRONG CODE\"))","v":0},null,null,null,null,null,null,""]
[{"$f":"'Order Form'!A222","v":201},{"$f":"'Order Form'!M222","v":""},{"$f":"'Order Form'!$E$4","v":0},{"$f":"'Order Form'!$E$5","v":0},{"$f":"'Order Form'!$E$6","v":0},{"$f":"'Order Form'!$E$7","v":0},{"$f":"'Order Form'!$E$9","v":0},{"$f":"'Order Form'!$E$8","v":0},{"$f":"'Order Form'!$E$10","v":0},{"$f":"'Order Form'!$E$11","v":0},{"$f":"IF(('Order Form'!$E$15=\"YES\"),'Order Form'!$E$12,\"\")","v":0},{"$f":"'Order Form'!$E$13 & \"\"","v":""},{"$f":"IF('Order Form'!D222=\"\",'Order Form'!C222,'Order Form'!D222) & \"\"","v":""},{"$f":"'Order Form'!E222 & \"\"","v":""},{"$f":"'Order Form'!F222","v":0},{"$f":"'Order Form'!I222","v":0},{"$f":"'Order Form'!G222","v":0},{"$f":"'Order Form'!H222","v":0},{"$f":"'Order Form'!J222 & \"\"","v":""},{"$f":"'Order Form'!L222 & \"\"","v":""},{"$f":"'Order Form'!C222 & \"\"","v":""},{"$f":"'Order Form'!K222 & \"\"","v":""},{"$f":"'Order Form'!$E$14","v":"YES"},{"$f":"'Order Form'!$E$19","v":0},{"$f":"'Order Form'!$E$16","v":"FREE gift card"},{"$f":"'Order Form'!$E$17","v":"No thanks"},"No","No",{"$f":"\"Dispatch Week: \"&'Order Form'!$E$18","v":"Dispatch Week: "},{"$f":"\"VIP: \"&'Order Form'!$E$5 &\"; Rib: \"&'Order Form'!$E$17 &\"; GT: \"&'Order Form'!$E$16","v":"VIP: ; Rib: No thanks; GT: FREE gift card"},null,null,null,{"$f":"IF(P202=\"\",\"\",IFERROR(INDIRECT(\"Postcodes!$C\"&SUMPRODUCT(--(Postcodes!$A$2:$A$100<=P202)*(Postcodes!$B$2:$B$100>=P202), ROW(Postcodes!$A$2:$A$100))),\"WRONG CODE\"))","v":0},null,null,null,null,null,null,""]
[{"$f":"'Order Form'!A223","v":202},{"$f":"'Order Form'!M223","v":""},{"$f":"'Order Form'!$E$4","v":0},{"$f":"'Order Form'!$E$5","v":0},{"$f":"'Order Form'!$E$6","v":0},{"$f":"'Order Form'!$E$7","v":0},{"$f":"'Order Form'!$E$9","v":0},{"$f":"'Order Form'!$E$8","v":0},{"$f":"'Order Form'!$E$10","v":0},{"$f":"'Order Form'!$E$11","v":0},{"$f":"IF(('Order Form'!$E$15=\"YES\"),'Order Form'!$E$12,\"\")","v":0},{"$f":"'Order Form'!$E$13 & \"\"","v":""},{"$f":"IF('Order Form'!D223=\"\",'Order Form'!C223,'Order Form'!D223) & \"\"","v":""},{"$f":"'Order Form'!E223 & \"\"","v":""},{"$f":"'Order Form'!F223","v":0},{"$f":"'Order Form'!I223","v":0},{"$f":"'Order Form'!G223","v":0},{"$f":"'Order Form'!H223","v":0},{"$f":"'Order Form'!J223 & \"\"","v":""},{"$f":"'Order Form'!L223 & \"\"","v":""},{"$f":"'Order Form'!C223 & \"\"","v":""},{"$f":"'Order Form'!K223 & \"\"","v":""},{"$f":"'Order Form'!$E$14","v":"YES"},{"$f":"'Order Form'!$E$19","v":0},{"$f":"'Order Form'!$E$16","v":"FREE gift card"},{"$f":"'Order Form'!$E$17","v":"No thanks"},"No","No",{"$f":"\"Dispatch Week: \"&'Order Form'!$E$18","v":"Dispatch Week: "},{"$f":"\"VIP: \"&'Order Form'!$E$5 &\"; Rib: \"&'Order Form'!$E$17 &\"; GT: \"&'Order Form'!$E$16","v":"VIP: ; Rib: No thanks; GT: FREE gift card"},null,null,null,{"$f":"IF(P203=\"\",\"\",IFERROR(INDIRECT(\"Postcodes!$C\"&SUMPRODUCT(--(Postcodes!$A$2:$A$100<=P203)*(Postcodes!$B$2:$B$100>=P203), ROW(Postcodes!$A$2:$A$100))),\"WRONG CODE\"))","v":0},null,null,null,null,null,null,""]
[{"$f":"'Order Form'!A224","v":203},{"$f":"'Order Form'!M224","v":""},{"$f":"'Order Form'!$E$4","v":0},{"$f":"'Order Form'!$E$5","v":0},{"$f":"'Order Form'!$E$6","v":0},{"$f":"'Order Form'!$E$7","v":0},{"$f":"'Order Form'!$E$9","v":0},{"$f":"'Order Form'!$E$8","v":0},{"$f":"'Order Form'!$E$10","v":0},{"$f":"'Order Form'!$E$11","v":0},{"$f":"IF(('Order Form'!$E$15=\"YES\"),'Order Form'!$E$12,\"\")","v":0},{"$f":"'Order Form'!$E$13 & \"\"","v":""},{"$f":"IF('Order Form'!D224=\"\",'Order Form'!C224,'Order Form'!D224) & \"\"","v":""},{"$f":"'Order Form'!E224 & \"\"","v":""},{"$f":"'Order Form'!F224","v":0},{"$f":"'Order Form'!I224","v":0},{"$f":"'Order Form'!G224","v":0},{"$f":"'Order Form'!H224","v":0},{"$f":"'Order Form'!J224 & \"\"","v":""},{"$f":"'Order Form'!L224 & \"\"","v":""},{"$f":"'Order Form'!C224 & \"\"","v":""},{"$f":"'Order Form'!K224 & \"\"","v":""},{"$f":"'Order Form'!$E$14","v":"YES"},{"$f":"'Order Form'!$E$19","v":0},{"$f":"'Order Form'!$E$16","v":"FREE gift card"},{"$f":"'Order Form'!$E$17","v":"No thanks"},"No","No",{"$f":"\"Dispatch Week: \"&'Order Form'!$E$18","v":"Dispatch Week: "},{"$f":"\"VIP: \"&'Order Form'!$E$5 &\"; Rib: \"&'Order Form'!$E$17 &\"; GT: \"&'Order Form'!$E$16","v":"VIP: ; Rib: No thanks; GT: FREE gift card"},null,null,null,{"$f":"IF(P204=\"\",\"\",IFERROR(INDIRECT(\"Postcodes!$C\"&SUMPRODUCT(--(Postcodes!$A$2:$A$100<=P204)*(Postcodes!$B$2:$B$100>=P204), ROW(Postcodes!$A$2:$A$100))),\"WRONG CODE\"))","v":0},null,null,null,null,null,null,""]
[{"$f":"'Order Form'!A225","v":204},{"$f":"'Order Form'!M225","v":""},{"$f":"'Order Form'!$E$4","v":0},{"$f":"'Order Form'!$E$5","v":0},{"$f":"'Order Form'!$E$6","v":0},{"$f":"'Order Form'!$E$7","v":0},{"$f":"'Order Form'!$E$9","v":0},{"$f":"'Order Form'!$E$8","v":0},{"$f":"'Order Form'!$E$10","v":0},{"$f":"'Order Form'!$E$11","v":0},{"$f":"IF(('Order Form'!$E$15=\"YES\"),'Order Form'!$E$12,\"\")","v":0},{"$f":"'Order Form'!$E$13 & \"\"","v":""},{"$f":"IF('Order Form'!D225=\"\",'Order Form'!C225,'Order Form'!D225) & \"\"","v":""},{"$f":"'Order Form'!E225 & \"\"","v":""},{"$f":"'Order Form'!F225","v":0},{"$f":"'Order Form'!I225","v":0},{"$f":"'Order Form'!G225","v":0},{"$f":"'Order Form'!H225","v":0},{"$f":"'Order Form'!J225 & \"\"","v":""},{"$f":"'Order Form'!L225 & \"\"","v":""},{"$f":"'Order Form'!C225 & \"\"","v":""},{"$f":"'Order Form'!K225 & \"\"","v":""},{"$f":"'Order Form'!$E$14","v":"YES"},{"$f":"'Order Form'!$E$19","v":0},{"$f":"'Order Form'!$E$16","v":"FREE gift card"},{"$f":"'Order Form'!$E$17","v":"No thanks"},"No","No",{"$f":"\"Dispatch Week: \"&'Order Form'!$E$18","v":"Dispatch Week: "},{"$f":"\"VIP: \"&'Order Form'!$E$5 &\"; Rib: \"&'Order Form'!$E$17 &\"; GT: \"&'Order Form'!$E$16","v":"VIP: ; Rib: No thanks; GT: FREE gift card"},null,null,null,{"$f":"IF(P205=\"\",\"\",IFERROR(INDIRECT(\"Postcodes!$C\"&SUMPRODUCT(--(Postcodes!$A$2:$A$100<=P205)*(Postcodes!$B$2:$B$100>=P205), ROW(Postcodes!$A$2:$A$100))),\"WRONG CODE\"))","v":0},null,null,null,null,null,null,""]
[{"$f":"'Order Form'!A226","v":205},{"$f":"'Order Form'!M226","v":""},{"$f":"'Order Form'!$E$4","v":0},{"$f":"'Order Form'!$E$5","v":0},{"$f":"'Order Form'!$E$6","v":0},{"$f":"'Order Form'!$E$7","v":0},{"$f":"'Order Form'!$E$9","v":0},{"$f":"'Order Form'!$E$8","v":0},{"$f":"'Order Form'!$E$10","v":0},{"$f":"'Order Form'!$E$11","v":0},{"$f":"IF(('Order Form'!$E$15=\"YES\"),'Order Form'!$E$12,\"\")","v":0},{"$f":"'Order Form'!$E$13 & \"\"","v":""},{"$f":"IF('Order Form'!D226=\"\",'Order Form'!C226,'Order Form'!D226) & \"\"","v":""},{"$f":"'Order Form'!E226 & \"\"","v":""},{"$f":"'Order Form'!F226","v":0},{"$f":"'Order Form'!I226","v":0},{"$f":"'Order Form'!G226","v":0},{"$f":"'Order Form'!H226","v":0},{"$f":"'Order Form'!J226 & \"\"","v":""},{"$f":"'Order Form'!L226 & \"\"","v":""},{"$f":"'Order Form'!C226 & \"\"","v":""},{"$f":"'Order Form'!K226 & \"\"","v":""},{"$f":"'Order Form'!$E$14","v":"YES"},{"$f":"'Order Form'!$E$19","v":0},{"$f":"'Order Form'!$E$16","v":"FREE gift card"},{"$f":"'Order Form'!$E$17","v":"No thanks"},"No","No",{"$f":"\"Dispatch Week: \"&'Order Form'!$E$18","v":"Dispatch Week: "},{"$f":"\"VIP: \"&'Order Form'!$E$5 &\"; Rib: \"&'Order Form'!$E$17 &\"; GT: \"&'Order Form'!$E$16","v":"VIP: ; Rib: No thanks; GT: FREE gift card"},null,null,null,{"$f":"IF(P206=\"\",\"\",IFERROR(INDIRECT(\"Postcodes!$C\"&SUMPRODUCT(--(Postcodes!$A$2:$A$100<=P206)*(Postcodes!$B$2:$B$100>=P206), ROW(Postcodes!$A$2:$A$100))),\"WRONG CODE\"))","v":0},null,null,null,null,null,null,""]
[{"$f":"'Order Form'!A227","v":206},{"$f":"'Order Form'!M227","v":""},{"$f":"'Order Form'!$E$4","v":0},{"$f":"'Order Form'!$E$5","v":0},{"$f":"'Order Form'!$E$6","v":0},{"$f":"'Order Form'!$E$7","v":0},{"$f":"'Order Form'!$E$9","v":0},{"$f":"'Order Form'!$E$8","v":0},{"$f":"'Order Form'!$E$10","v":0},{"$f":"'Order Form'!$E$11","v":0},{"$f":"IF(('Order Form'!$E$15=\"YES\"),'Order Form'!$E$12,\"\")","v":0},{"$f":"'Order Form'!$E$13 & \"\"","v":""},{"$f":"IF('Order Form'!D227=\"\",'Order Form'!C227,'Order Form'!D227) & \"\"","v":""},{"$f":"'Order Form'!E227 & \"\"","v":""},{"$f":"'Order Form'!F227","v":0},{"$f":"'Order Form'!I227","v":0},{"$f":"'Order Form'!G227","v":0},{"$f":"'Order Form'!H227","v":0},{"$f":"'Order Form'!J227 & \"\"","v":""},{"$f":"'Order Form'!L227 & \"\"","v":""},{"$f":"'Order Form'!C227 & \"\"","v":""},{"$f":"'Order Form'!K227 & \"\"","v":""},{"$f":"'Order Form'!$E$14","v":"YES"},{"$f":"'Order Form'!$E$19","v":0},{"$f":"'Order Form'!$E$16","v":"FREE gift card"},{"$f":"'Order Form'!$E$17","v":"No thanks"},"No","No",{"$f":"\"Dispatch Week: \"&'Order Form'!$E$18","v":"Dispatch Week: "},{"$f":"\"VIP: \"&'Order Form'!$E$5 &\"; Rib: \"&'Order Form'!$E$17 &\"; GT: \"&'Order Form'!$E$16","v":"VIP: ; Rib: No thanks; GT: FREE gift card"},null,null,null,{"$f":"IF(P207=\"\",\"\",IFERROR(INDIRECT(\"Postcodes!$C\"&SUMPRODUCT(--(Postcodes!$A$2:$A$100<=P207)*(Postcodes!$B$2:$B$100>=P207), ROW(Postcodes!$A$2:$A$100))),\"WRONG CODE\"))","v":0},null,null,null,null,null,null,""]
[{"$f":"'Order Form'!A228","v":207},{"$f":"'Order Form'!M228","v":""},{"$f":"'Order Form'!$E$4","v":0},{"$f":"'Order Form'!$E$5","v":0},{"$f":"'Order Form'!$E$6","v":0},{"$f":"'Order Form'!$E$7","v":0},{"$f":"'Order Form'!$E$9","v":0},{"$f":"'Order Form'!$E$8","v":0},{"$f":"'Order Form'!$E$10","v":0},{"$f":"'Order Form'!$E$11","v":0},{"$f":"IF(('Order Form'!$E$15=\"YES\"),'Order Form'!$E$12,\"\")","v":0},{"$f":"'Order Form'!$E$13 & \"\"","v":""},{"$f":"IF('Order Form'!D228=\"\",'Order Form'!C228,'Order Form'!D228) & \"\"","v":""},{"$f":"'Order Form'!E228 & \"\"","v":""},{"$f":"'Order Form'!F228","v":0},{"$f":"'Order Form'!I228","v":0},{"$f":"'Order Form'!G228","v":0},{"$f":"'Order Form'!H228","v":0},{"$f":"'Order Form'!J228 & \"\"","v":""},{"$f":"'Order Form'!L228 & \"\"","v":""},{"$f":"'Order Form'!C228 & \"\"","v":""},{"$f":"'Order Form'!K228 & \"\"","v":""},{"$f":"'Order Form'!$E$14","v":"YES"},{"$f":"'Order Form'!$E$19","v":0},{"$f":"'Order Form'!$E$16","v":"FREE gift card"},{"$f":"'Order Form'!$E$17","v":"No thanks"},"No","No",{"$f":"\"Dispatch Week: \"&'Order Form'!$E$18","v":"Dispatch Week: "},{"$f":"\"VIP: \"&'Order Form'!$E$5 &\"; Rib: \"&'Order Form'!$E$17 &\"; GT: \"&'Order Form'!$E$16","v":"VIP: ; Rib: No thanks; GT: FREE gift card"},null,null,null,{"$f":"IF(P208=\"\",\"\",IFERROR(INDIRECT(\"Postcodes!$C\"&SUMPRODUCT(--(Postcodes!$A$2:$A$100<=P208)*(Postcodes!$B$2:$B$100>=P208), ROW(Postcodes!$A$2:$A$100))),\"WRONG CODE\"))","v":0},null,null,null,null,null,null,""]
[{"$f":"'Order Form'!A229","v":208},{"$f":"'Order Form'!M229","v":""},{"$f":"'Order Form'!$E$4","v":0},{"$f":"'Order Form'!$E$5","v":0},{"$f":"'Order Form'!$E$6","v":0},{"$f":"'Order Form'!$E$7","v":0},{"$f":"'Order Form'!$E$9","v":0},{"$f":"'Order Form'!$E$8","v":0},{"$f":"'Order Form'!$E$10","v":0},{"$f":"'Order Form'!$E$11","v":0},{"$f":"IF(('Order Form'!$E$15=\"YES\"),'Order Form'!$E$12,\"\")","v":0},{"$f":"'Order Form'!$E$13 & \"\"","v":""},{"$f":"IF('Order Form'!D229=\"\",'Order Form'!C229,'Order Form'!D229) & \"\"","v":""},{"$f":"'Order Form'!E229 & \"\"","v":""},{"$f":"'Order Form'!F229","v":0},{"$f":"'Order Form'!I229","v":0},{"$f":"'Order Form'!G229","v":0},{"$f":"'Order Form'!H229","v":0},{"$f":"'Order Form'!J229 & \"\"","v":""},{"$f":"'Order Form'!L229 & \"\"","v":""},{"$f":"'Order Form'!C229 & \"\"","v":""},{"$f":"'Order Form'!K229 & \"\"","v":""},{"$f":"'Order Form'!$E$14","v":"YES"},{"$f":"'Order Form'!$E$19","v":0},{"$f":"'Order Form'!$E$16","v":"FREE gift card"},{"$f":"'Order Form'!$E$17","v":"No thanks"},"No","No",{"$f":"\"Dispatch Week: \"&'Order Form'!$E$18","v":"Dispatch Week: "},{"$f":"\"VIP: \"&'Order Form'!$E$5 &\"; Rib: \"&'Order Form'!$E$17 &\"; GT: \"&'Order Form'!$E$16","v":"VIP: ; Rib: No thanks; GT: FREE gift card"},null,null,null,{"$f":"IF(P209=\"\",\"\",IFERROR(INDIRECT(\"Postcodes!$C\"&SUMPRODUCT(--(Postcodes!$A$2:$A$100<=P209)*(Postcodes!$B$2:$B$100>=P209), ROW(Postcodes!$A$2:$A$100))),\"WRONG CODE\"))","v":0},null,null,null,null,null,null,""]
[{"$f":"'Order Form'!A230","v":209},{"$f":"'Order Form'!M230","v":""},{"$f":"'Order Form'!$E$4","v":0},{"$f":"'Order Form'!$E$5","v":0},{"$f":"'Order Form'!$E$6","v":0},{"$f":"'Order Form'!$E$7","v":0},{"$f":"'Order Form'!$E$9","v":0},{"$f":"'Order Form'!$E$8","v":0},{"$f":"'Order Form'!$E$10","v":0},{"$f":"'Order Form'!$E$11","v":0},{"$f":"IF(('Order Form'!$E$15=\"YES\"),'Order Form'!$E$12,\"\")","v":0},{"$f":"'Order Form'!$E$13 & \"\"","v":""},{"$f":"IF('Order Form'!D230=\"\",'Order Form'!C230,'Order Form'!D230) & \"\"","v":""},{"$f":"'Order Form'!E230 & \"\"","v":""},{"$f":"'Order Form'!F230","v":0},{"$f":"'Order Form'!I230","v":0},{"$f":"'Order Form'!G230","v":0},{"$f":"'Order Form'!H230","v":0},{"$f":"'Order Form'!J230 & \"\"","v":""},{"$f":"'Order Form'!L230 & \"\"","v":""},{"$f":"'Order Form'!C230 & \"\"","v":""},{"$f":"'Order Form'!K230 & \"\"","v":""},{"$f":"'Order Form'!$E$14","v":"YES"},{"$f":"'Order Form'!$E$19","v":0},{"$f":"'Order Form'!$E$16","v":"FREE gift card"},{"$f":"'Order Form'!$E$17","v":"No thanks"},"No","No",{"$f":"\"Dispatch Week: \"&'Order Form'!$E$18","v":"Dispatch Week: "},{"$f":"\"VIP: \"&'Order Form'!$E$5 &\"; Rib: \"&'Order Form'!$E$17 &\"; GT: \"&'Order Form'!$E$16","v":"VIP: ; Rib: No thanks; GT: FREE gift card"},null,null,null,{"$f":"IF(P210=\"\",\"\",IFERROR(INDIRECT(\"Postcodes!$C\"&SUMPRODUCT(--(Postcodes!$A$2:$A$100<=P210)*(Postcodes!$B$2:$B$100>=P210), ROW(Postcodes!$A$2:$A$100))),\"WRONG CODE\"))","v":0},null,null,null,null,null,null,""]
[{"$f":"'Order Form'!A231","v":210},{"$f":"'Order Form'!M231","v":""},{"$f":"'Order Form'!$E$4","v":0},{"$f":"'Order Form'!$E$5","v":0},{"$f":"'Order Form'!$E$6","v":0},{"$f":"'Order Form'!$E$7","v":0},{"$f":"'Order Form'!$E$9","v":0},{"$f":"'Order Form'!$E$8","v":0},{"$f":"'Order Form'!$E$10","v":0},{"$f":"'Order Form'!$E$11","v":0},{"$f":"IF(('Order Form'!$E$15=\"YES\"),'Order Form'!$E$12,\"\")","v":0},{"$f":"'Order Form'!$E$13 & \"\"","v":""},{"$f":"IF('Order Form'!D231=\"\",'Order Form'!C231,'Order Form'!D231) & \"\"","v":""},{"$f":"'Order Form'!E231 & \"\"","v":""},{"$f":"'Order Form'!F231","v":0},{"$f":"'Order Form'!I231","v":0},{"$f":"'Order Form'!G231","v":0},{"$f":"'Order Form'!H231","v":0},{"$f":"'Order Form'!J231 & \"\"","v":""},{"$f":"'Order Form'!L231 & \"\"","v":""},{"$f":"'Order Form'!C231 & \"\"","v":""},{"$f":"'Order Form'!K231 & \"\"","v":""},{"$f":"'Order Form'!$E$14","v":"YES"},{"$f":"'Order Form'!$E$19","v":0},{"$f":"'Order Form'!$E$16","v":"FREE gift card"},{"$f":"'Order Form'!$E$17","v":"No thanks"},"No","No",{"$f":"\"Dispatch Week: \"&'Order Form'!$E$18","v":"Dispatch Week: "},{"$f":"\"VIP: \"&'Order Form'!$E$5 &\"; Rib: \"&'Order Form'!$E$17 &\"; GT: \"&'Order Form'!$E$16","v":"VIP: ; Rib: No thanks; GT: FREE gift card"},null,null,null,{"$f":"IF(P211=\"\",\"\",IFERROR(INDIRECT(\"Postcodes!$C\"&SUMPRODUCT(--(Postcodes!$A$2:$A$100<=P211)*(Postcodes!$B$2:$B$100>=P211), ROW(Postcodes!$A$2:$A$100))),\"WRONG CODE\"))","v":0},null,null,null,null,null,null,""]
[{"$f":"'Order Form'!A232","v":211},{"$f":"'Order Form'!M232","v":""},{"$f":"'Order Form'!$E$4","v":0},{"$f":"'Order Form'!$E$5","v":0},{"$f":"'Order Form'!$E$6","v":0},{"$f":"'Order Form'!$E$7","v":0},{"$f":"'Order Form'!$E$9","v":0},{"$f":"'Order Form'!$E$8","v":0},{"$f":"'Order Form'!$E$10","v":0},{"$f":"'Order Form'!$E$11","v":0},{"$f":"IF(('Order Form'!$E$15=\"YES\"),'Order Form'!$E$12,\"\")","v":0},{"$f":"'Order Form'!$E$13 & \"\"","v":""},{"$f":"IF('Order Form'!D232=\"\",'Order Form'!C232,'Order Form'!D232) & \"\"","v":""},{"$f":"'Order Form'!E232 & \"\"","v":""},{"$f":"'Order Form'!F232","v":0},{"$f":"'Order Form'!I232","v":0},{"$f":"'Order Form'!G232","v":0},{"$f":"'Order Form'!H232","v":0},{"$f":"'Order Form'!J232 & \"\"","v":""},{"$f":"'Order Form'!L232 & \"\"","v":""},{"$f":"'Order Form'!C232 & \"\"","v":""},{"$f":"'Order Form'!K232 & \"\"","v":""},{"$f":"'Order Form'!$E$14","v":"YES"},{"$f":"'Order Form'!$E$19","v":0},{"$f":"'Order Form'!$E$16","v":"FREE gift card"},{"$f":"'Order Form'!$E$17","v":"No thanks"},"No","No",{"$f":"\"Dispatch Week: \"&'Order Form'!$E$18","v":"Dispatch Week: "},{"$f":"\"VIP: \"&'Order Form'!$E$5 &\"; Rib: \"&'Order Form'!$E$17 &\"; GT: \"&'Order Form'!$E$16","v":"VIP: ; Rib: No thanks; GT: FREE gift card"},null,null,null,{"$f":"IF(P212=\"\",\"\",IFERROR(INDIRECT(\"Postcodes!$C\"&SUMPRODUCT(--(Postcodes!$A$2:$A$100<=P212)*(Postcodes!$B$2:$B$100>=P212), ROW(Postcodes!$A$2:$A$100))),\"WRONG CODE\"))","v":0},null,null,null,null,null,null,""]
[{"$f":"'Order Form'!A233","v":212},{"$f":"'Order Form'!M233","v":""},{"$f":"'Order Form'!$E$4","v":0},{"$f":"'Order Form'!$E$5","v":0},{"$f":"'Order Form'!$E$6","v":0},{"$f":"'Order Form'!$E$7","v":0},{"$f":"'Order Form'!$E$9","v":0},{"$f":"'Order Form'!$E$8","v":0},{"$f":"'Order Form'!$E$10","v":0},{"$f":"'Order Form'!$E$11","v":0},{"$f":"IF(('Order Form'!$E$15=\"YES\"),'Order Form'!$E$12,\"\")","v":0},{"$f":"'Order Form'!$E$13 & \"\"","v":""},{"$f":"IF('Order Form'!D233=\"\",'Order Form'!C233,'Order Form'!D233) & \"\"","v":""},{"$f":"'Order Form'!E233 & \"\"","v":""},{"$f":"'Order Form'!F233","v":0},{"$f":"'Order Form'!I233","v":0},{"$f":"'Order Form'!G233","v":0},{"$f":"'Order Form'!H233","v":0},{"$f":"'Order Form'!J233 & \"\"","v":""},{"$f":"'Order Form'!L233 & \"\"","v":""},{"$f":"'Order Form'!C233 & \"\"","v":""},{"$f":"'Order Form'!K233 & \"\"","v":""},{"$f":"'Order Form'!$E$14","v":"YES"},{"$f":"'Order Form'!$E$19","v":0},{"$f":"'Order Form'!$E$16","v":"FREE gift card"},{"$f":"'Order Form'!$E$17","v":"No thanks"},"No","No",{"$f":"\"Dispatch Week: \"&'Order Form'!$E$18","v":"Dispatch Week: "},{"$f":"\"VIP: \"&'Order Form'!$E$5 &\"; Rib: \"&'Order Form'!$E$17 &\"; GT: \"&'Order Form'!$E$16","v":"VIP: ; Rib: No thanks; GT: FREE gift card"},null,null,null,{"$f":"IF(P213=\"\",\"\",IFERROR(INDIRECT(\"Postcodes!$C\"&SUMPRODUCT(--(Postcodes!$A$2:$A$100<=P213)*(Postcodes!$B$2:$B$100>=P213), ROW(Postcodes!$A$2:$A$100))),\"WRONG CODE\"))","v":0},null,null,null,null,null,null,""]
[{"$f":"'Order Form'!A234","v":213},{"$f":"'Order Form'!M234","v":""},{"$f":"'Order Form'!$E$4","v":0},{"$f":"'Order Form'!$E$5","v":0},{"$f":"'Order Form'!$E$6","v":0},{"$f":"'Order Form'!$E$7","v":0},{"$f":"'Order Form'!$E$9","v":0},{"$f":"'Order Form'!$E$8","v":0},{"$f":"'Order Form'!$E$10","v":0},{"$f":"'Order Form'!$E$11","v":0},{"$f":"IF(('Order Form'!$E$15=\"YES\"),'Order Form'!$E$12,\"\")","v":0},{"$f":"'Order Form'!$E$13 & \"\"","v":""},{"$f":"IF('Order Form'!D234=\"\",'Order Form'!C234,'Order Form'!D234) & \"\"","v":""},{"$f":"'Order Form'!E234 & \"\"","v":""},{"$f":"'Order Form'!F234","v":0},{"$f":"'Order Form'!I234","v":0},{"$f":"'Order Form'!G234","v":0},{"$f":"'Order Form'!H234","v":0},{"$f":"'Order Form'!J234 & \"\"","v":""},{"$f":"'Order Form'!L234 & \"\"","v":""},{"$f":"'Order Form'!C234 & \"\"","v":""},{"$f":"'Order Form'!K234 & \"\"","v":""},{"$f":"'Order Form'!$E$14","v":"YES"},{"$f":"'Order Form'!$E$19","v":0},{"$f":"'Order Form'!$E$16","v":"FREE gift card"},{"$f":"'Order Form'!$E$17","v":"No thanks"},"No","No",{"$f":"\"Dispatch Week: \"&'Order Form'!$E$18","v":"Dispatch Week: "},{"$f":"\"VIP: \"&'Order Form'!$E$5 &\"; Rib: \"&'Order Form'!$E$17 &\"; GT: \"&'Order Form'!$E$16","v":"VIP: ; Rib: No thanks; GT: FREE gift card"},null,null,null,{"$f":"IF(P214=\"\",\"\",IFERROR(INDIRECT(\"Postcodes!$C\"&SUMPRODUCT(--(Postcodes!$A$2:$A$100<=P214)*(Postcodes!$B$2:$B$100>=P214), ROW(Postcodes!$A$2:$A$100))),\"WRONG CODE\"))","v":0},null,null,null,null,null,null,""]
[{"$f":"'Order Form'!A235","v":214},{"$f":"'Order Form'!M235","v":""},{"$f":"'Order Form'!$E$4","v":0},{"$f":"'Order Form'!$E$5","v":0},{"$f":"'Order Form'!$E$6","v":0},{"$f":"'Order Form'!$E$7","v":0},{"$f":"'Order Form'!$E$9","v":0},{"$f":"'Order Form'!$E$8","v":0},{"$f":"'Order Form'!$E$10","v":0},{"$f":"'Order Form'!$E$11","v":0},{"$f":"IF(('Order Form'!$E$15=\"YES\"),'Order Form'!$E$12,\"\")","v":0},{"$f":"'Order Form'!$E$13 & \"\"","v":""},{"$f":"IF('Order Form'!D235=\"\",'Order Form'!C235,'Order Form'!D235) & \"\"","v":""},{"$f":"'Order Form'!E235 & \"\"","v":""},{"$f":"'Order Form'!F235","v":0},{"$f":"'Order Form'!I235","v":0},{"$f":"'Order Form'!G235","v":0},{"$f":"'Order Form'!H235","v":0},{"$f":"'Order Form'!J235 & \"\"","v":""},{"$f":"'Order Form'!L235 & \"\"","v":""},{"$f":"'Order Form'!C235 & \"\"","v":""},{"$f":"'Order Form'!K235 & \"\"","v":""},{"$f":"'Order Form'!$E$14","v":"YES"},{"$f":"'Order Form'!$E$19","v":0},{"$f":"'Order Form'!$E$16","v":"FREE gift card"},{"$f":"'Order Form'!$E$17","v":"No thanks"},"No","No",{"$f":"\"Dispatch Week: \"&'Order Form'!$E$18","v":"Dispatch Week: "},{"$f":"\"VIP: \"&'Order Form'!$E$5 &\"; Rib: \"&'Order Form'!$E$17 &\"; GT: \"&'Order Form'!$E$16","v":"VIP: ; Rib: No thanks; GT: FREE gift card"},null,null,null,{"$f":"IF(P215=\"\",\"\",IFERROR(INDIRECT(\"Postcodes!$C\"&SUMPRODUCT(--(Postcodes!$A$2:$A$100<=P215)*(Postcodes!$B$2:$B$100>=P215), ROW(Postcodes!$A$2:$A$100))),\"WRONG CODE\"))","v":0},null,null,null,null,null,null,""]
[{"$f":"'Order Form'!A236","v":215},{"$f":"'Order Form'!M236","v":""},{"$f":"'Order Form'!$E$4","v":0},{"$f":"'Order Form'!$E$5","v":0},{"$f":"'Order Form'!$E$6","v":0},{"$f":"'Order Form'!$E$7","v":0},{"$f":"'Order Form'!$E$9","v":0},{"$f":"'Order Form'!$E$8","v":0},{"$f":"'Order Form'!$E$10","v":0},{"$f":"'Order Form'!$E$11","v":0},{"$f":"IF(('Order Form'!$E$15=\"YES\"),'Order Form'!$E$12,\"\")","v":0},{"$f":"'Order Form'!$E$13 & \"\"","v":""},{"$f":"IF('Order Form'!D236=\"\",'Order Form'!C236,'Order Form'!D236) & \"\"","v":""},{"$f":"'Order Form'!E236 & \"\"","v":""},{"$f":"'Order Form'!F236","v":0},{"$f":"'Order Form'!I236","v":0},{"$f":"'Order Form'!G236","v":0},{"$f":"'Order Form'!H236","v":0},{"$f":"'Order Form'!J236 & \"\"","v":""},{"$f":"'Order Form'!L236 & \"\"","v":""},{"$f":"'Order Form'!C236 & \"\"","v":""},{"$f":"'Order Form'!K236 & \"\"","v":""},{"$f":"'Order Form'!$E$14","v":"YES"},{"$f":"'Order Form'!$E$19","v":0},{"$f":"'Order Form'!$E$16","v":"FREE gift card"},{"$f":"'Order Form'!$E$17","v":"No thanks"},"No","No",{"$f":"\"Dispatch Week: \"&'Order Form'!$E$18","v":"Dispatch Week: "},{"$f":"\"VIP: \"&'Order Form'!$E$5 &\"; Rib: \"&'Order Form'!$E$17 &\"; GT: \"&'Order Form'!$E$16","v":"VIP: ; Rib: No thanks; GT: FREE gift card"},null,null,null,{"$f":"IF(P216=\"\",\"\",IFERROR(INDIRECT(\"Postcodes!$C\"&SUMPRODUCT(--(Postcodes!$A$2:$A$100<=P216)*(Postcodes!$B$2:$B$100>=P216), ROW(Postcodes!$A$2:$A$100))),\"WRONG CODE\"))","v":0},null,null,null,null,null,null,""]
[{"$f":"'Order Form'!A237","v":216},{"$f":"'Order Form'!M237","v":""},{"$f":"'Order Form'!$E$4","v":0},{"$f":"'Order Form'!$E$5","v":0},{"$f":"'Order Form'!$E$6","v":0},{"$f":"'Order Form'!$E$7","v":0},{"$f":"'Order Form'!$E$9","v":0},{"$f":"'Order Form'!$E$8","v":0},{"$f":"'Order Form'!$E$10","v":0},{"$f":"'Order Form'!$E$11","v":0},{"$f":"IF(('Order Form'!$E$15=\"YES\"),'Order Form'!$E$12,\"\")","v":0},{"$f":"'Order Form'!$E$13 & \"\"","v":""},{"$f":"IF('Order Form'!D237=\"\",'Order Form'!C237,'Order Form'!D237) & \"\"","v":""},{"$f":"'Order Form'!E237 & \"\"","v":""},{"$f":"'Order Form'!F237","v":0},{"$f":"'Order Form'!I237","v":0},{"$f":"'Order Form'!G237","v":0},{"$f":"'Order Form'!H237","v":0},{"$f":"'Order Form'!J237 & \"\"","v":""},{"$f":"'Order Form'!L237 & \"\"","v":""},{"$f":"'Order Form'!C237 & \"\"","v":""},{"$f":"'Order Form'!K237 & \"\"","v":""},{"$f":"'Order Form'!$E$14","v":"YES"},{"$f":"'Order Form'!$E$19","v":0},{"$f":"'Order Form'!$E$16","v":"FREE gift card"},{"$f":"'Order Form'!$E$17","v":"No thanks"},"No","No",{"$f":"\"Dispatch Week: \"&'Order Form'!$E$18","v":"Dispatch Week: "},{"$f":"\"VIP: \"&'Order Form'!$E$5 &\"; Rib: \"&'Order Form'!$E$17 &\"; GT: \"&'Order Form'!$E$16","v":"VIP: ; Rib: No thanks; GT: FREE gift card"},null,null,null,{"$f":"IF(P217=\"\",\"\",IFERROR(INDIRECT(\"Postcodes!$C\"&SUMPRODUCT(--(Postcodes!$A$2:$A$100<=P217)*(Postcodes!$B$2:$B$100>=P217), ROW(Postcodes!$A$2:$A$100))),\"WRONG CODE\"))","v":0},null,null,null,null,null,null,""]
[{"$f":"'Order Form'!A238","v":217},{"$f":"'Order Form'!M238","v":""},{"$f":"'Order Form'!$E$4","v":0},{"$f":"'Order Form'!$E$5","v":0},{"$f":"'Order Form'!$E$6","v":0},{"$f":"'Order Form'!$E$7","v":0},{"$f":"'Order Form'!$E$9","v":0},{"$f":"'Order Form'!$E$8","v":0},{"$f":"'Order Form'!$E$10","v":0},{"$f":"'Order Form'!$E$11","v":0},{"$f":"IF(('Order Form'!$E$15=\"YES\"),'Order Form'!$E$12,\"\")","v":0},{"$f":"'Order Form'!$E$13 & \"\"","v":""},{"$f":"IF('Order Form'!D238=\"\",'Order Form'!C238,'Order Form'!D238) & \"\"","v":""},{"$f":"'Order Form'!E238 & \"\"","v":""},{"$f":"'Order Form'!F238","v":0},{"$f":"'Order Form'!I238","v":0},{"$f":"'Order Form'!G238","v":0},{"$f":"'Order Form'!H238","v":0},{"$f":"'Order Form'!J238 & \"\"","v":""},{"$f":"'Order Form'!L238 & \"\"","v":""},{"$f":"'Order Form'!C238 & \"\"","v":""},{"$f":"'Order Form'!K238 & \"\"","v":""},{"$f":"'Order Form'!$E$14","v":"YES"},{"$f":"'Order Form'!$E$19","v":0},{"$f":"'Order Form'!$E$16","v":"FREE gift card"},{"$f":"'Order Form'!$E$17","v":"No thanks"},"No","No",{"$f":"\"Dispatch Week: \"&'Order Form'!$E$18","v":"Dispatch Week: "},{"$f":"\"VIP: \"&'Order Form'!$E$5 &\"; Rib: \"&'Order Form'!$E$17 &\"; GT: \"&'Order Form'!$E$16","v":"VIP: ; Rib: No thanks; GT: FREE gift card"},null,null,null,{"$f":"IF(P218=\"\",\"\",IFERROR(INDIRECT(\"Postcodes!$C\"&SUMPRODUCT(--(Postcodes!$A$2:$A$100<=P218)*(Postcodes!$B$2:$B$100>=P218), ROW(Postcodes!$A$2:$A$100))),\"WRONG CODE\"))","v":0},null,null,null,null,null,null,""]
[{"$f":"'Order Form'!A239","v":218},{"$f":"'Order Form'!M239","v":""},{"$f":"'Order Form'!$E$4","v":0},{"$f":"'Order Form'!$E$5","v":0},{"$f":"'Order Form'!$E$6","v":0},{"$f":"'Order Form'!$E$7","v":0},{"$f":"'Order Form'!$E$9","v":0},{"$f":"'Order Form'!$E$8","v":0},{"$f":"'Order Form'!$E$10","v":0},{"$f":"'Order Form'!$E$11","v":0},{"$f":"IF(('Order Form'!$E$15=\"YES\"),'Order Form'!$E$12,\"\")","v":0},{"$f":"'Order Form'!$E$13 & \"\"","v":""},{"$f":"IF('Order Form'!D239=\"\",'Order Form'!C239,'Order Form'!D239) & \"\"","v":""},{"$f":"'Order Form'!E239 & \"\"","v":""},{"$f":"'Order Form'!F239","v":0},{"$f":"'Order Form'!I239","v":0},{"$f":"'Order Form'!G239","v":0},{"$f":"'Order Form'!H239","v":0},{"$f":"'Order Form'!J239 & \"\"","v":""},{"$f":"'Order Form'!L239 & \"\"","v":""},{"$f":"'Order Form'!C239 & \"\"","v":""},{"$f":"'Order Form'!K239 & \"\"","v":""},{"$f":"'Order Form'!$E$14","v":"YES"},{"$f":"'Order Form'!$E$19","v":0},{"$f":"'Order Form'!$E$16","v":"FREE gift card"},{"$f":"'Order Form'!$E$17","v":"No thanks"},"No","No",{"$f":"\"Dispatch Week: \"&'Order Form'!$E$18","v":"Dispatch Week: "},{"$f":"\"VIP: \"&'Order Form'!$E$5 &\"; Rib: \"&'Order Form'!$E$17 &\"; GT: \"&'Order Form'!$E$16","v":"VIP: ; Rib: No thanks; GT: FREE gift card"},null,null,null,{"$f":"IF(P219=\"\",\"\",IFERROR(INDIRECT(\"Postcodes!$C\"&SUMPRODUCT(--(Postcodes!$A$2:$A$100<=P219)*(Postcodes!$B$2:$B$100>=P219), ROW(Postcodes!$A$2:$A$100))),\"WRONG CODE\"))","v":0},null,null,null,null,null,null,""]
[{"$f":"'Order Form'!A240","v":219},{"$f":"'Order Form'!M240","v":""},{"$f":"'Order Form'!$E$4","v":0},{"$f":"'Order Form'!$E$5","v":0},{"$f":"'Order Form'!$E$6","v":0},{"$f":"'Order Form'!$E$7","v":0},{"$f":"'Order Form'!$E$9","v":0},{"$f":"'Order Form'!$E$8","v":0},{"$f":"'Order Form'!$E$10","v":0},{"$f":"'Order Form'!$E$11","v":0},{"$f":"IF(('Order Form'!$E$15=\"YES\"),'Order Form'!$E$12,\"\")","v":0},{"$f":"'Order Form'!$E$13 & \"\"","v":""},{"$f":"IF('Order Form'!D240=\"\",'Order Form'!C240,'Order Form'!D240) & \"\"","v":""},{"$f":"'Order Form'!E240 & \"\"","v":""},{"$f":"'Order Form'!F240","v":0},{"$f":"'Order Form'!I240","v":0},{"$f":"'Order Form'!G240","v":0},{"$f":"'Order Form'!H240","v":0},{"$f":"'Order Form'!J240 & \"\"","v":""},{"$f":"'Order Form'!L240 & \"\"","v":""},{"$f":"'Order Form'!C240 & \"\"","v":""},{"$f":"'Order Form'!K240 & \"\"","v":""},{"$f":"'Order Form'!$E$14","v":"YES"},{"$f":"'Order Form'!$E$19","v":0},{"$f":"'Order Form'!$E$16","v":"FREE gift card"},{"$f":"'Order Form'!$E$17","v":"No thanks"},"No","No",{"$f":"\"Dispatch Week: \"&'Order Form'!$E$18","v":"Dispatch Week: "},{"$f":"\"VIP: \"&'Order Form'!$E$5 &\"; Rib: \"&'Order Form'!$E$17 &\"; GT: \"&'Order Form'!$E$16","v":"VIP: ; Rib: No thanks; GT: FREE gift card"},null,null,null,{"$f":"IF(P220=\"\",\"\",IFERROR(INDIRECT(\"Postcodes!$C\"&SUMPRODUCT(--(Postcodes!$A$2:$A$100<=P220)*(Postcodes!$B$2:$B$100>=P220), ROW(Postcodes!$A$2:$A$100))),\"WRONG CODE\"))","v":0},null,null,null,null,null,null,""]
[{"$f":"'Order Form'!A241","v":220},{"$f":"'Order Form'!M241","v":""},{"$f":"'Order Form'!$E$4","v":0},{"$f":"'Order Form'!$E$5","v":0},{"$f":"'Order Form'!$E$6","v":0},{"$f":"'Order Form'!$E$7","v":0},{"$f":"'Order Form'!$E$9","v":0},{"$f":"'Order Form'!$E$8","v":0},{"$f":"'Order Form'!$E$10","v":0},{"$f":"'Order Form'!$E$11","v":0},{"$f":"IF(('Order Form'!$E$15=\"YES\"),'Order Form'!$E$12,\"\")","v":0},{"$f":"'Order Form'!$E$13 & \"\"","v":""},{"$f":"IF('Order Form'!D241=\"\",'Order Form'!C241,'Order Form'!D241) & \"\"","v":""},{"$f":"'Order Form'!E241 & \"\"","v":""},{"$f":"'Order Form'!F241","v":0},{"$f":"'Order Form'!I241","v":0},{"$f":"'Order Form'!G241","v":0},{"$f":"'Order Form'!H241","v":0},{"$f":"'Order Form'!J241 & \"\"","v":""},{"$f":"'Order Form'!L241 & \"\"","v":""},{"$f":"'Order Form'!C241 & \"\"","v":""},{"$f":"'Order Form'!K241 & \"\"","v":""},{"$f":"'Order Form'!$E$14","v":"YES"},{"$f":"'Order Form'!$E$19","v":0},{"$f":"'Order Form'!$E$16","v":"FREE gift card"},{"$f":"'Order Form'!$E$17","v":"No thanks"},"No","No",{"$f":"\"Dispatch Week: \"&'Order Form'!$E$18","v":"Dispatch Week: "},{"$f":"\"VIP: \"&'Order Form'!$E$5 &\"; Rib: \"&'Order Form'!$E$17 &\"; GT: \"&'Order Form'!$E$16","v":"VIP: ; Rib: No thanks; GT: FREE gift card"},null,null,null,{"$f":"IF(P221=\"\",\"\",IFERROR(INDIRECT(\"Postcodes!$C\"&SUMPRODUCT(--(Postcodes!$A$2:$A$100<=P221)*(Postcodes!$B$2:$B$100>=P221), ROW(Postcodes!$A$2:$A$100))),\"WRONG CODE\"))","v":0},null,null,null,null,null,null,""]
[{"$f":"'Order Form'!A242","v":221},{"$f":"'Order Form'!M242","v":""},{"$f":"'Order Form'!$E$4","v":0},{"$f":"'Order Form'!$E$5","v":0},{"$f":"'Order Form'!$E$6","v":0},{"$f":"'Order Form'!$E$7","v":0},{"$f":"'Order Form'!$E$9","v":0},{"$f":"'Order Form'!$E$8","v":0},{"$f":"'Order Form'!$E$10","v":0},{"$f":"'Order Form'!$E$11","v":0},{"$f":"IF(('Order Form'!$E$15=\"YES\"),'Order Form'!$E$12,\"\")","v":0},{"$f":"'Order Form'!$E$13 & \"\"","v":""},{"$f":"IF('Order Form'!D242=\"\",'Order Form'!C242,'Order Form'!D242) & \"\"","v":""},{"$f":"'Order Form'!E242 & \"\"","v":""},{"$f":"'Order Form'!F242","v":0},{"$f":"'Order Form'!I242","v":0},{"$f":"'Order Form'!G242","v":0},{"$f":"'Order Form'!H242","v":0},{"$f":"'Order Form'!J242 & \"\"","v":""},{"$f":"'Order Form'!L242 & \"\"","v":""},{"$f":"'Order Form'!C242 & \"\"","v":""},{"$f":"'Order Form'!K242 & \"\"","v":""},{"$f":"'Order Form'!$E$14","v":"YES"},{"$f":"'Order Form'!$E$19","v":0},{"$f":"'Order Form'!$E$16","v":"FREE gift card"},{"$f":"'Order Form'!$E$17","v":"No thanks"},"No","No",{"$f":"\"Dispatch Week: \"&'Order Form'!$E$18","v":"Dispatch Week: "},{"$f":"\"VIP: \"&'Order Form'!$E$5 &\"; Rib: \"&'Order Form'!$E$17 &\"; GT: \"&'Order Form'!$E$16","v":"VIP: ; Rib: No thanks; GT: FREE gift card"},null,null,null,{"$f":"IF(P222=\"\",\"\",IFERROR(INDIRECT(\"Postcodes!$C\"&SUMPRODUCT(--(Postcodes!$A$2:$A$100<=P222)*(Postcodes!$B$2:$B$100>=P222), ROW(Postcodes!$A$2:$A$100))),\"WRONG CODE\"))","v":0},null,null,null,null,null,null,""]
[{"$f":"'Order Form'!A243","v":222},{"$f":"'Order Form'!M243","v":""},{"$f":"'Order Form'!$E$4","v":0},{"$f":"'Order Form'!$E$5","v":0},{"$f":"'Order Form'!$E$6","v":0},{"$f":"'Order Form'!$E$7","v":0},{"$f":"'Order Form'!$E$9","v":0},{"$f":"'Order Form'!$E$8","v":0},{"$f":"'Order Form'!$E$10","v":0},{"$f":"'Order Form'!$E$11","v":0},{"$f":"IF(('Order Form'!$E$15=\"YES\"),'Order Form'!$E$12,\"\")","v":0},{"$f":"'Order Form'!$E$13 & \"\"","v":""},{"$f":"IF('Order Form'!D243=\"\",'Order Form'!C243,'Order Form'!D243) & \"\"","v":""},{"$f":"'Order Form'!E243 & \"\"","v":""},{"$f":"'Order Form'!F243","v":0},{"$f":"'Order Form'!I243","v":0},{"$f":"'Order Form'!G243","v":0},{"$f":"'Order Form'!H243","v":0},{"$f":"'Order Form'!J243 & \"\"","v":""},{"$f":"'Order Form'!L243 & \"\"","v":""},{"$f":"'Order Form'!C243 & \"\"","v":""},{"$f":"'Order Form'!K243 & \"\"","v":""},{"$f":"'Order Form'!$E$14","v":"YES"},{"$f":"'Order Form'!$E$19","v":0},{"$f":"'Order Form'!$E$16","v":"FREE gift card"},{"$f":"'Order Form'!$E$17","v":"No thanks"},"No","No",{"$f":"\"Dispatch Week: \"&'Order Form'!$E$18","v":"Dispatch Week: "},{"$f":"\"VIP: \"&'Order Form'!$E$5 &\"; Rib: \"&'Order Form'!$E$17 &\"; GT: \"&'Order Form'!$E$16","v":"VIP: ; Rib: No thanks; GT: FREE gift card"},null,null,null,{"$f":"IF(P223=\"\",\"\",IFERROR(INDIRECT(\"Postcodes!$C\"&SUMPRODUCT(--(Postcodes!$A$2:$A$100<=P223)*(Postcodes!$B$2:$B$100>=P223), ROW(Postcodes!$A$2:$A$100))),\"WRONG CODE\"))","v":0},null,null,null,null,null,null,""]
[{"$f":"'Order Form'!A244","v":223},{"$f":"'Order Form'!M244","v":""},{"$f":"'Order Form'!$E$4","v":0},{"$f":"'Order Form'!$E$5","v":0},{"$f":"'Order Form'!$E$6","v":0},{"$f":"'Order Form'!$E$7","v":0},{"$f":"'Order Form'!$E$9","v":0},{"$f":"'Order Form'!$E$8","v":0},{"$f":"'Order Form'!$E$10","v":0},{"$f":"'Order Form'!$E$11","v":0},{"$f":"IF(('Order Form'!$E$15=\"YES\"),'Order Form'!$E$12,\"\")","v":0},{"$f":"'Order Form'!$E$13 & \"\"","v":""},{"$f":"IF('Order Form'!D244=\"\",'Order Form'!C244,'Order Form'!D244) & \"\"","v":""},{"$f":"'Order Form'!E244 & \"\"","v":""},{"$f":"'Order Form'!F244","v":0},{"$f":"'Order Form'!I244","v":0},{"$f":"'Order Form'!G244","v":0},{"$f":"'Order Form'!H244","v":0},{"$f":"'Order Form'!J244 & \"\"","v":""},{"$f":"'Order Form'!L244 & \"\"","v":""},{"$f":"'Order Form'!C244 & \"\"","v":""},{"$f":"'Order Form'!K244 & \"\"","v":""},{"$f":"'Order Form'!$E$14","v":"YES"},{"$f":"'Order Form'!$E$19","v":0},{"$f":"'Order Form'!$E$16","v":"FREE gift card"},{"$f":"'Order Form'!$E$17","v":"No thanks"},"No","No",{"$f":"\"Dispatch Week: \"&'Order Form'!$E$18","v":"Dispatch Week: "},{"$f":"\"VIP: \"&'Order Form'!$E$5 &\"; Rib: \"&'Order Form'!$E$17 &\"; GT: \"&'Order Form'!$E$16","v":"VIP: ; Rib: No thanks; GT: FREE gift card"},null,null,null,{"$f":"IF(P224=\"\",\"\",IFERROR(INDIRECT(\"Postcodes!$C\"&SUMPRODUCT(--(Postcodes!$A$2:$A$100<=P224)*(Postcodes!$B$2:$B$100>=P224), ROW(Postcodes!$A$2:$A$100))),\"WRONG CODE\"))","v":0},null,null,null,null,null,null,""]
[{"$f":"'Order Form'!A245","v":224},{"$f":"'Order Form'!M245","v":""},{"$f":"'Order Form'!$E$4","v":0},{"$f":"'Order Form'!$E$5","v":0},{"$f":"'Order Form'!$E$6","v":0},{"$f":"'Order Form'!$E$7","v":0},{"$f":"'Order Form'!$E$9","v":0},{"$f":"'Order Form'!$E$8","v":0},{"$f":"'Order Form'!$E$10","v":0},{"$f":"'Order Form'!$E$11","v":0},{"$f":"IF(('Order Form'!$E$15=\"YES\"),'Order Form'!$E$12,\"\")","v":0},{"$f":"'Order Form'!$E$13 & \"\"","v":""},{"$f":"IF('Order Form'!D245=\"\",'Order Form'!C245,'Order Form'!D245) & \"\"","v":""},{"$f":"'Order Form'!E245 & \"\"","v":""},{"$f":"'Order Form'!F245","v":0},{"$f":"'Order Form'!I245","v":0},{"$f":"'Order Form'!G245","v":0},{"$f":"'Order Form'!H245","v":0},{"$f":"'Order Form'!J245 & \"\"","v":""},{"$f":"'Order Form'!L245 & \"\"","v":""},{"$f":"'Order Form'!C245 & \"\"","v":""},{"$f":"'Order Form'!K245 & \"\"","v":""},{"$f":"'Order Form'!$E$14","v":"YES"},{"$f":"'Order Form'!$E$19","v":0},{"$f":"'Order Form'!$E$16","v":"FREE gift card"},{"$f":"'Order Form'!$E$17","v":"No thanks"},"No","No",{"$f":"\"Dispatch Week: \"&'Order Form'!$E$18","v":"Dispatch Week: "},{"$f":"\"VIP: \"&'Order Form'!$E$5 &\"; Rib: \"&'Order Form'!$E$17 &\"; GT: \"&'Order Form'!$E$16","v":"VIP: ; Rib: No thanks; GT: FREE gift card"},null,null,null,{"$f":"IF(P225=\"\",\"\",IFERROR(INDIRECT(\"Postcodes!$C\"&SUMPRODUCT(--(Postcodes!$A$2:$A$100<=P225)*(Postcodes!$B$2:$B$100>=P225), ROW(Postcodes!$A$2:$A$100))),\"WRONG CODE\"))","v":0},null,null,null,null,null,null,""]
[{"$f":"'Order Form'!A246","v":225},{"$f":"'Order Form'!M246","v":""},{"$f":"'Order Form'!$E$4","v":0},{"$f":"'Order Form'!$E$5","v":0},{"$f":"'Order Form'!$E$6","v":0},{"$f":"'Order Form'!$E$7","v":0},{"$f":"'Order Form'!$E$9","v":0},{"$f":"'Order Form'!$E$8","v":0},{"$f":"'Order Form'!$E$10","v":0},{"$f":"'Order Form'!$E$11","v":0},{"$f":"IF(('Order Form'!$E$15=\"YES\"),'Order Form'!$E$12,\"\")","v":0},{"$f":"'Order Form'!$E$13 & \"\"","v":""},{"$f":"IF('Order Form'!D246=\"\",'Order Form'!C246,'Order Form'!D246) & \"\"","v":""},{"$f":"'Order Form'!E246 & \"\"","v":""},{"$f":"'Order Form'!F246","v":0},{"$f":"'Order Form'!I246","v":0},{"$f":"'Order Form'!G246","v":0},{"$f":"'Order Form'!H246","v":0},{"$f":"'Order Form'!J246 & \"\"","v":""},{"$f":"'Order Form'!L246 & \"\"","v":""},{"$f":"'Order Form'!C246 & \"\"","v":""},{"$f":"'Order Form'!K246 & \"\"","v":""},{"$f":"'Order Form'!$E$14","v":"YES"},{"$f":"'Order Form'!$E$19","v":0},{"$f":"'Order Form'!$E$16","v":"FREE gift card"},{"$f":"'Order Form'!$E$17","v":"No thanks"},"No","No",{"$f":"\"Dispatch Week: \"&'Order Form'!$E$18","v":"Dispatch Week: "},{"$f":"\"VIP: \"&'Order Form'!$E$5 &\"; Rib: \"&'Order Form'!$E$17 &\"; GT: \"&'Order Form'!$E$16","v":"VIP: ; Rib: No thanks; GT: FREE gift card"},null,null,null,{"$f":"IF(P226=\"\",\"\",IFERROR(INDIRECT(\"Postcodes!$C\"&SUMPRODUCT(--(Postcodes!$A$2:$A$100<=P226)*(Postcodes!$B$2:$B$100>=P226), ROW(Postcodes!$A$2:$A$100))),\"WRONG CODE\"))","v":0},null,null,null,null,null,null,""]
[{"$f":"'Order Form'!A247","v":226},{"$f":"'Order Form'!M247","v":""},{"$f":"'Order Form'!$E$4","v":0},{"$f":"'Order Form'!$E$5","v":0},{"$f":"'Order Form'!$E$6","v":0},{"$f":"'Order Form'!$E$7","v":0},{"$f":"'Order Form'!$E$9","v":0},{"$f":"'Order Form'!$E$8","v":0},{"$f":"'Order Form'!$E$10","v":0},{"$f":"'Order Form'!$E$11","v":0},{"$f":"IF(('Order Form'!$E$15=\"YES\"),'Order Form'!$E$12,\"\")","v":0},{"$f":"'Order Form'!$E$13 & \"\"","v":""},{"$f":"IF('Order Form'!D247=\"\",'Order Form'!C247,'Order Form'!D247) & \"\"","v":""},{"$f":"'Order Form'!E247 & \"\"","v":""},{"$f":"'Order Form'!F247","v":0},{"$f":"'Order Form'!I247","v":0},{"$f":"'Order Form'!G247","v":0},{"$f":"'Order Form'!H247","v":0},{"$f":"'Order Form'!J247 & \"\"","v":""},{"$f":"'Order Form'!L247 & \"\"","v":""},{"$f":"'Order Form'!C247 & \"\"","v":""},{"$f":"'Order Form'!K247 & \"\"","v":""},{"$f":"'Order Form'!$E$14","v":"YES"},{"$f":"'Order Form'!$E$19","v":0},{"$f":"'Order Form'!$E$16","v":"FREE gift card"},{"$f":"'Order Form'!$E$17","v":"No thanks"},"No","No",{"$f":"\"Dispatch Week: \"&'Order Form'!$E$18","v":"Dispatch Week: "},{"$f":"\"VIP: \"&'Order Form'!$E$5 &\"; Rib: \"&'Order Form'!$E$17 &\"; GT: \"&'Order Form'!$E$16","v":"VIP: ; Rib: No thanks; GT: FREE gift card"},null,null,null,{"$f":"IF(P227=\"\",\"\",IFERROR(INDIRECT(\"Postcodes!$C\"&SUMPRODUCT(--(Postcodes!$A$2:$A$100<=P227)*(Postcodes!$B$2:$B$100>=P227), ROW(Postcodes!$A$2:$A$100))),\"WRONG CODE\"))","v":0},null,null,null,null,null,null,""]
[{"$f":"'Order Form'!A248","v":227},{"$f":"'Order Form'!M248","v":""},{"$f":"'Order Form'!$E$4","v":0},{"$f":"'Order Form'!$E$5","v":0},{"$f":"'Order Form'!$E$6","v":0},{"$f":"'Order Form'!$E$7","v":0},{"$f":"'Order Form'!$E$9","v":0},{"$f":"'Order Form'!$E$8","v":0},{"$f":"'Order Form'!$E$10","v":0},{"$f":"'Order Form'!$E$11","v":0},{"$f":"IF(('Order Form'!$E$15=\"YES\"),'Order Form'!$E$12,\"\")","v":0},{"$f":"'Order Form'!$E$13 & \"\"","v":""},{"$f":"IF('Order Form'!D248=\"\",'Order Form'!C248,'Order Form'!D248) & \"\"","v":""},{"$f":"'Order Form'!E248 & \"\"","v":""},{"$f":"'Order Form'!F248","v":0},{"$f":"'Order Form'!I248","v":0},{"$f":"'Order Form'!G248","v":0},{"$f":"'Order Form'!H248","v":0},{"$f":"'Order Form'!J248 & \"\"","v":""},{"$f":"'Order Form'!L248 & \"\"","v":""},{"$f":"'Order Form'!C248 & \"\"","v":""},{"$f":"'Order Form'!K248 & \"\"","v":""},{"$f":"'Order Form'!$E$14","v":"YES"},{"$f":"'Order Form'!$E$19","v":0},{"$f":"'Order Form'!$E$16","v":"FREE gift card"},{"$f":"'Order Form'!$E$17","v":"No thanks"},"No","No",{"$f":"\"Dispatch Week: \"&'Order Form'!$E$18","v":"Dispatch Week: "},{"$f":"\"VIP: \"&'Order Form'!$E$5 &\"; Rib: \"&'Order Form'!$E$17 &\"; GT: \"&'Order Form'!$E$16","v":"VIP: ; Rib: No thanks; GT: FREE gift card"},null,null,null,{"$f":"IF(P228=\"\",\"\",IFERROR(INDIRECT(\"Postcodes!$C\"&SUMPRODUCT(--(Postcodes!$A$2:$A$100<=P228)*(Postcodes!$B$2:$B$100>=P228), ROW(Postcodes!$A$2:$A$100))),\"WRONG CODE\"))","v":0},null,null,null,null,null,null,""]
[{"$f":"'Order Form'!A249","v":228},{"$f":"'Order Form'!M249","v":""},{"$f":"'Order Form'!$E$4","v":0},{"$f":"'Order Form'!$E$5","v":0},{"$f":"'Order Form'!$E$6","v":0},{"$f":"'Order Form'!$E$7","v":0},{"$f":"'Order Form'!$E$9","v":0},{"$f":"'Order Form'!$E$8","v":0},{"$f":"'Order Form'!$E$10","v":0},{"$f":"'Order Form'!$E$11","v":0},{"$f":"IF(('Order Form'!$E$15=\"YES\"),'Order Form'!$E$12,\"\")","v":0},{"$f":"'Order Form'!$E$13 & \"\"","v":""},{"$f":"IF('Order Form'!D249=\"\",'Order Form'!C249,'Order Form'!D249) & \"\"","v":""},{"$f":"'Order Form'!E249 & \"\"","v":""},{"$f":"'Order Form'!F249","v":0},{"$f":"'Order Form'!I249","v":0},{"$f":"'Order Form'!G249","v":0},{"$f":"'Order Form'!H249","v":0},{"$f":"'Order Form'!J249 & \"\"","v":""},{"$f":"'Order Form'!L249 & \"\"","v":""},{"$f":"'Order Form'!C249 & \"\"","v":""},{"$f":"'Order Form'!K249 & \"\"","v":""},{"$f":"'Order Form'!$E$14","v":"YES"},{"$f":"'Order Form'!$E$19","v":0},{"$f":"'Order Form'!$E$16","v":"FREE gift card"},{"$f":"'Order Form'!$E$17","v":"No thanks"},"No","No",{"$f":"\"Dispatch Week: \"&'Order Form'!$E$18","v":"Dispatch Week: "},{"$f":"\"VIP: \"&'Order Form'!$E$5 &\"; Rib: \"&'Order Form'!$E$17 &\"; GT: \"&'Order Form'!$E$16","v":"VIP: ; Rib: No thanks; GT: FREE gift card"},null,null,null,{"$f":"IF(P229=\"\",\"\",IFERROR(INDIRECT(\"Postcodes!$C\"&SUMPRODUCT(--(Postcodes!$A$2:$A$100<=P229)*(Postcodes!$B$2:$B$100>=P229), ROW(Postcodes!$A$2:$A$100))),\"WRONG CODE\"))","v":0},null,null,null,null,null,null,""]
[{"$f":"'Order Form'!A250","v":229},{"$f":"'Order Form'!M250","v":""},{"$f":"'Order Form'!$E$4","v":0},{"$f":"'Order Form'!$E$5","v":0},{"$f":"'Order Form'!$E$6","v":0},{"$f":"'Order Form'!$E$7","v":0},{"$f":"'Order Form'!$E$9","v":0},{"$f":"'Order Form'!$E$8","v":0},{"$f":"'Order Form'!$E$10","v":0},{"$f":"'Order Form'!$E$11","v":0},{"$f":"IF(('Order Form'!$E$15=\"YES\"),'Order Form'!$E$12,\"\")","v":0},{"$f":"'Order Form'!$E$13 & \"\"","v":""},{"$f":"IF('Order Form'!D250=\"\",'Order Form'!C250,'Order Form'!D250) & \"\"","v":""},{"$f":"'Order Form'!E250 & \"\"","v":""},{"$f":"'Order Form'!F250","v":0},{"$f":"'Order Form'!I250","v":0},{"$f":"'Order Form'!G250","v":0},{"$f":"'Order Form'!H250","v":0},{"$f":"'Order Form'!J250 & \"\"","v":""},{"$f":"'Order Form'!L250 & \"\"","v":""},{"$f":"'Order Form'!C250 & \"\"","v":""},{"$f":"'Order Form'!K250 & \"\"","v":""},{"$f":"'Order Form'!$E$14","v":"YES"},{"$f":"'Order Form'!$E$19","v":0},{"$f":"'Order Form'!$E$16","v":"FREE gift card"},{"$f":"'Order Form'!$E$17","v":"No thanks"},"No","No",{"$f":"\"Dispatch Week: \"&'Order Form'!$E$18","v":"Dispatch Week: "},{"$f":"\"VIP: \"&'Order Form'!$E$5 &\"; Rib: \"&'Order Form'!$E$17 &\"; GT: \"&'Order Form'!$E$16","v":"VIP: ; Rib: No thanks; GT: FREE gift card"},null,null,null,{"$f":"IF(P230=\"\",\"\",IFERROR(INDIRECT(\"Postcodes!$C\"&SUMPRODUCT(--(Postcodes!$A$2:$A$100<=P230)*(Postcodes!$B$2:$B$100>=P230), ROW(Postcodes!$A$2:$A$100))),\"WRONG CODE\"))","v":0},null,null,null,null,null,null,""]
[{"$f":"'Order Form'!A251","v":230},{"$f":"'Order Form'!M251","v":""},{"$f":"'Order Form'!$E$4","v":0},{"$f":"'Order Form'!$E$5","v":0},{"$f":"'Order Form'!$E$6","v":0},{"$f":"'Order Form'!$E$7","v":0},{"$f":"'Order Form'!$E$9","v":0},{"$f":"'Order Form'!$E$8","v":0},{"$f":"'Order Form'!$E$10","v":0},{"$f":"'Order Form'!$E$11","v":0},{"$f":"IF(('Order Form'!$E$15=\"YES\"),'Order Form'!$E$12,\"\")","v":0},{"$f":"'Order Form'!$E$13 & \"\"","v":""},{"$f":"IF('Order Form'!D251=\"\",'Order Form'!C251,'Order Form'!D251) & \"\"","v":""},{"$f":"'Order Form'!E251 & \"\"","v":""},{"$f":"'Order Form'!F251","v":0},{"$f":"'Order Form'!I251","v":0},{"$f":"'Order Form'!G251","v":0},{"$f":"'Order Form'!H251","v":0},{"$f":"'Order Form'!J251 & \"\"","v":""},{"$f":"'Order Form'!L251 & \"\"","v":""},{"$f":"'Order Form'!C251 & \"\"","v":""},{"$f":"'Order Form'!K251 & \"\"","v":""},{"$f":"'Order Form'!$E$14","v":"YES"},{"$f":"'Order Form'!$E$19","v":0},{"$f":"'Order Form'!$E$16","v":"FREE gift card"},{"$f":"'Order Form'!$E$17","v":"No thanks"},"No","No",{"$f":"\"Dispatch Week: \"&'Order Form'!$E$18","v":"Dispatch Week: "},{"$f":"\"VIP: \"&'Order Form'!$E$5 &\"; Rib: \"&'Order Form'!$E$17 &\"; GT: \"&'Order Form'!$E$16","v":"VIP: ; Rib: No thanks; GT: FREE gift card"},null,null,null,{"$f":"IF(P231=\"\",\"\",IFERROR(INDIRECT(\"Postcodes!$C\"&SUMPRODUCT(--(Postcodes!$A$2:$A$100<=P231)*(Postcodes!$B$2:$B$100>=P231), ROW(Postcodes!$A$2:$A$100))),\"WRONG CODE\"))","v":0},null,null,null,null,null,null,""]
[{"$f":"'Order Form'!A252","v":231},{"$f":"'Order Form'!M252","v":""},{"$f":"'Order Form'!$E$4","v":0},{"$f":"'Order Form'!$E$5","v":0},{"$f":"'Order Form'!$E$6","v":0},{"$f":"'Order Form'!$E$7","v":0},{"$f":"'Order Form'!$E$9","v":0},{"$f":"'Order Form'!$E$8","v":0},{"$f":"'Order Form'!$E$10","v":0},{"$f":"'Order Form'!$E$11","v":0},{"$f":"IF(('Order Form'!$E$15=\"YES\"),'Order Form'!$E$12,\"\")","v":0},{"$f":"'Order Form'!$E$13 & \"\"","v":""},{"$f":"IF('Order Form'!D252=\"\",'Order Form'!C252,'Order Form'!D252) & \"\"","v":""},{"$f":"'Order Form'!E252 & \"\"","v":""},{"$f":"'Order Form'!F252","v":0},{"$f":"'Order Form'!I252","v":0},{"$f":"'Order Form'!G252","v":0},{"$f":"'Order Form'!H252","v":0},{"$f":"'Order Form'!J252 & \"\"","v":""},{"$f":"'Order Form'!L252 & \"\"","v":""},{"$f":"'Order Form'!C252 & \"\"","v":""},{"$f":"'Order Form'!K252 & \"\"","v":""},{"$f":"'Order Form'!$E$14","v":"YES"},{"$f":"'Order Form'!$E$19","v":0},{"$f":"'Order Form'!$E$16","v":"FREE gift card"},{"$f":"'Order Form'!$E$17","v":"No thanks"},"No","No",{"$f":"\"Dispatch Week: \"&'Order Form'!$E$18","v":"Dispatch Week: "},{"$f":"\"VIP: \"&'Order Form'!$E$5 &\"; Rib: \"&'Order Form'!$E$17 &\"; GT: \"&'Order Form'!$E$16","v":"VIP: ; Rib: No thanks; GT: FREE gift card"},null,null,null,{"$f":"IF(P232=\"\",\"\",IFERROR(INDIRECT(\"Postcodes!$C\"&SUMPRODUCT(--(Postcodes!$A$2:$A$100<=P232)*(Postcodes!$B$2:$B$100>=P232), ROW(Postcodes!$A$2:$A$100))),\"WRONG CODE\"))","v":0},null,null,null,null,null,null,""]
[{"$f":"'Order Form'!A253","v":232},{"$f":"'Order Form'!M253","v":""},{"$f":"'Order Form'!$E$4","v":0},{"$f":"'Order Form'!$E$5","v":0},{"$f":"'Order Form'!$E$6","v":0},{"$f":"'Order Form'!$E$7","v":0},{"$f":"'Order Form'!$E$9","v":0},{"$f":"'Order Form'!$E$8","v":0},{"$f":"'Order Form'!$E$10","v":0},{"$f":"'Order Form'!$E$11","v":0},{"$f":"IF(('Order Form'!$E$15=\"YES\"),'Order Form'!$E$12,\"\")","v":0},{"$f":"'Order Form'!$E$13 & \"\"","v":""},{"$f":"IF('Order Form'!D253=\"\",'Order Form'!C253,'Order Form'!D253) & \"\"","v":""},{"$f":"'Order Form'!E253 & \"\"","v":""},{"$f":"'Order Form'!F253","v":0},{"$f":"'Order Form'!I253","v":0},{"$f":"'Order Form'!G253","v":0},{"$f":"'Order Form'!H253","v":0},{"$f":"'Order Form'!J253 & \"\"","v":""},{"$f":"'Order Form'!L253 & \"\"","v":""},{"$f":"'Order Form'!C253 & \"\"","v":""},{"$f":"'Order Form'!K253 & \"\"","v":""},{"$f":"'Order Form'!$E$14","v":"YES"},{"$f":"'Order Form'!$E$19","v":0},{"$f":"'Order Form'!$E$16","v":"FREE gift card"},{"$f":"'Order Form'!$E$17","v":"No thanks"},"No","No",{"$f":"\"Dispatch Week: \"&'Order Form'!$E$18","v":"Dispatch Week: "},{"$f":"\"VIP: \"&'Order Form'!$E$5 &\"; Rib: \"&'Order Form'!$E$17 &\"; GT: \"&'Order Form'!$E$16","v":"VIP: ; Rib: No thanks; GT: FREE gift card"},null,null,null,{"$f":"IF(P233=\"\",\"\",IFERROR(INDIRECT(\"Postcodes!$C\"&SUMPRODUCT(--(Postcodes!$A$2:$A$100<=P233)*(Postcodes!$B$2:$B$100>=P233), ROW(Postcodes!$A$2:$A$100))),\"WRONG CODE\"))","v":0},null,null,null,null,null,null,""]
[{"$f":"'Order Form'!A254","v":233},{"$f":"'Order Form'!M254","v":""},{"$f":"'Order Form'!$E$4","v":0},{"$f":"'Order Form'!$E$5","v":0},{"$f":"'Order Form'!$E$6","v":0},{"$f":"'Order Form'!$E$7","v":0},{"$f":"'Order Form'!$E$9","v":0},{"$f":"'Order Form'!$E$8","v":0},{"$f":"'Order Form'!$E$10","v":0},{"$f":"'Order Form'!$E$11","v":0},{"$f":"IF(('Order Form'!$E$15=\"YES\"),'Order Form'!$E$12,\"\")","v":0},{"$f":"'Order Form'!$E$13 & \"\"","v":""},{"$f":"IF('Order Form'!D254=\"\",'Order Form'!C254,'Order Form'!D254) & \"\"","v":""},{"$f":"'Order Form'!E254 & \"\"","v":""},{"$f":"'Order Form'!F254","v":0},{"$f":"'Order Form'!I254","v":0},{"$f":"'Order Form'!G254","v":0},{"$f":"'Order Form'!H254","v":0},{"$f":"'Order Form'!J254 & \"\"","v":""},{"$f":"'Order Form'!L254 & \"\"","v":""},{"$f":"'Order Form'!C254 & \"\"","v":""},{"$f":"'Order Form'!K254 & \"\"","v":""},{"$f":"'Order Form'!$E$14","v":"YES"},{"$f":"'Order Form'!$E$19","v":0},{"$f":"'Order Form'!$E$16","v":"FREE gift card"},{"$f":"'Order Form'!$E$17","v":"No thanks"},"No","No",{"$f":"\"Dispatch Week: \"&'Order Form'!$E$18","v":"Dispatch Week: "},{"$f":"\"VIP: \"&'Order Form'!$E$5 &\"; Rib: \"&'Order Form'!$E$17 &\"; GT: \"&'Order Form'!$E$16","v":"VIP: ; Rib: No thanks; GT: FREE gift card"},null,null,null,{"$f":"IF(P234=\"\",\"\",IFERROR(INDIRECT(\"Postcodes!$C\"&SUMPRODUCT(--(Postcodes!$A$2:$A$100<=P234)*(Postcodes!$B$2:$B$100>=P234), ROW(Postcodes!$A$2:$A$100))),\"WRONG CODE\"))","v":0},null,null,null,null,null,null,""]
[{"$f":"'Order Form'!A255","v":234},{"$f":"'Order Form'!M255","v":""},{"$f":"'Order Form'!$E$4","v":0},{"$f":"'Order Form'!$E$5","v":0},{"$f":"'Order Form'!$E$6","v":0},{"$f":"'Order Form'!$E$7","v":0},{"$f":"'Order Form'!$E$9","v":0},{"$f":"'Order Form'!$E$8","v":0},{"$f":"'Order Form'!$E$10","v":0},{"$f":"'Order Form'!$E$11","v":0},{"$f":"IF(('Order Form'!$E$15=\"YES\"),'Order Form'!$E$12,\"\")","v":0},{"$f":"'Order Form'!$E$13 & \"\"","v":""},{"$f":"IF('Order Form'!D255=\"\",'Order Form'!C255,'Order Form'!D255) & \"\"","v":""},{"$f":"'Order Form'!E255 & \"\"","v":""},{"$f":"'Order Form'!F255","v":0},{"$f":"'Order Form'!I255","v":0},{"$f":"'Order Form'!G255","v":0},{"$f":"'Order Form'!H255","v":0},{"$f":"'Order Form'!J255 & \"\"","v":""},{"$f":"'Order Form'!L255 & \"\"","v":""},{"$f":"'Order Form'!C255 & \"\"","v":""},{"$f":"'Order Form'!K255 & \"\"","v":""},{"$f":"'Order Form'!$E$14","v":"YES"},{"$f":"'Order Form'!$E$19","v":0},{"$f":"'Order Form'!$E$16","v":"FREE gift card"},{"$f":"'Order Form'!$E$17","v":"No thanks"},"No","No",{"$f":"\"Dispatch Week: \"&'Order Form'!$E$18","v":"Dispatch Week: "},{"$f":"\"VIP: \"&'Order Form'!$E$5 &\"; Rib: \"&'Order Form'!$E$17 &\"; GT: \"&'Order Form'!$E$16","v":"VIP: ; Rib: No thanks; GT: FREE gift card"},null,null,null,{"$f":"IF(P235=\"\",\"\",IFERROR(INDIRECT(\"Postcodes!$C\"&SUMPRODUCT(--(Postcodes!$A$2:$A$100<=P235)*(Postcodes!$B$2:$B$100>=P235), ROW(Postcodes!$A$2:$A$100))),\"WRONG CODE\"))","v":0},null,null,null,null,null,null,""]
[{"$f":"'Order Form'!A256","v":235},{"$f":"'Order Form'!M256","v":""},{"$f":"'Order Form'!$E$4","v":0},{"$f":"'Order Form'!$E$5","v":0},{"$f":"'Order Form'!$E$6","v":0},{"$f":"'Order Form'!$E$7","v":0},{"$f":"'Order Form'!$E$9","v":0},{"$f":"'Order Form'!$E$8","v":0},{"$f":"'Order Form'!$E$10","v":0},{"$f":"'Order Form'!$E$11","v":0},{"$f":"IF(('Order Form'!$E$15=\"YES\"),'Order Form'!$E$12,\"\")","v":0},{"$f":"'Order Form'!$E$13 & \"\"","v":""},{"$f":"IF('Order Form'!D256=\"\",'Order Form'!C256,'Order Form'!D256) & \"\"","v":""},{"$f":"'Order Form'!E256 & \"\"","v":""},{"$f":"'Order Form'!F256","v":0},{"$f":"'Order Form'!I256","v":0},{"$f":"'Order Form'!G256","v":0},{"$f":"'Order Form'!H256","v":0},{"$f":"'Order Form'!J256 & \"\"","v":""},{"$f":"'Order Form'!L256 & \"\"","v":""},{"$f":"'Order Form'!C256 & \"\"","v":""},{"$f":"'Order Form'!K256 & \"\"","v":""},{"$f":"'Order Form'!$E$14","v":"YES"},{"$f":"'Order Form'!$E$19","v":0},{"$f":"'Order Form'!$E$16","v":"FREE gift card"},{"$f":"'Order Form'!$E$17","v":"No thanks"},"No","No",{"$f":"\"Dispatch Week: \"&'Order Form'!$E$18","v":"Dispatch Week: "},{"$f":"\"VIP: \"&'Order Form'!$E$5 &\"; Rib: \"&'Order Form'!$E$17 &\"; GT: \"&'Order Form'!$E$16","v":"VIP: ; Rib: No thanks; GT: FREE gift card"},null,null,null,{"$f":"IF(P236=\"\",\"\",IFERROR(INDIRECT(\"Postcodes!$C\"&SUMPRODUCT(--(Postcodes!$A$2:$A$100<=P236)*(Postcodes!$B$2:$B$100>=P236), ROW(Postcodes!$A$2:$A$100))),\"WRONG CODE\"))","v":0},null,null,null,null,null,null,""]
[{"$f":"'Order Form'!A257","v":236},{"$f":"'Order Form'!M257","v":""},{"$f":"'Order Form'!$E$4","v":0},{"$f":"'Order Form'!$E$5","v":0},{"$f":"'Order Form'!$E$6","v":0},{"$f":"'Order Form'!$E$7","v":0},{"$f":"'Order Form'!$E$9","v":0},{"$f":"'Order Form'!$E$8","v":0},{"$f":"'Order Form'!$E$10","v":0},{"$f":"'Order Form'!$E$11","v":0},{"$f":"IF(('Order Form'!$E$15=\"YES\"),'Order Form'!$E$12,\"\")","v":0},{"$f":"'Order Form'!$E$13 & \"\"","v":""},{"$f":"IF('Order Form'!D257=\"\",'Order Form'!C257,'Order Form'!D257) & \"\"","v":""},{"$f":"'Order Form'!E257 & \"\"","v":""},{"$f":"'Order Form'!F257","v":0},{"$f":"'Order Form'!I257","v":0},{"$f":"'Order Form'!G257","v":0},{"$f":"'Order Form'!H257","v":0},{"$f":"'Order Form'!J257 & \"\"","v":""},{"$f":"'Order Form'!L257 & \"\"","v":""},{"$f":"'Order Form'!C257 & \"\"","v":""},{"$f":"'Order Form'!K257 & \"\"","v":""},{"$f":"'Order Form'!$E$14","v":"YES"},{"$f":"'Order Form'!$E$19","v":0},{"$f":"'Order Form'!$E$16","v":"FREE gift card"},{"$f":"'Order Form'!$E$17","v":"No thanks"},"No","No",{"$f":"\"Dispatch Week: \"&'Order Form'!$E$18","v":"Dispatch Week: "},{"$f":"\"VIP: \"&'Order Form'!$E$5 &\"; Rib: \"&'Order Form'!$E$17 &\"; GT: \"&'Order Form'!$E$16","v":"VIP: ; Rib: No thanks; GT: FREE gift card"},null,null,null,{"$f":"IF(P237=\"\",\"\",IFERROR(INDIRECT(\"Postcodes!$C\"&SUMPRODUCT(--(Postcodes!$A$2:$A$100<=P237)*(Postcodes!$B$2:$B$100>=P237), ROW(Postcodes!$A$2:$A$100))),\"WRONG CODE\"))","v":0},null,null,null,null,null,null,""]
[{"$f":"'Order Form'!A258","v":237},{"$f":"'Order Form'!M258","v":""},{"$f":"'Order Form'!$E$4","v":0},{"$f":"'Order Form'!$E$5","v":0},{"$f":"'Order Form'!$E$6","v":0},{"$f":"'Order Form'!$E$7","v":0},{"$f":"'Order Form'!$E$9","v":0},{"$f":"'Order Form'!$E$8","v":0},{"$f":"'Order Form'!$E$10","v":0},{"$f":"'Order Form'!$E$11","v":0},{"$f":"IF(('Order Form'!$E$15=\"YES\"),'Order Form'!$E$12,\"\")","v":0},{"$f":"'Order Form'!$E$13 & \"\"","v":""},{"$f":"IF('Order Form'!D258=\"\",'Order Form'!C258,'Order Form'!D258) & \"\"","v":""},{"$f":"'Order Form'!E258 & \"\"","v":""},{"$f":"'Order Form'!F258","v":0},{"$f":"'Order Form'!I258","v":0},{"$f":"'Order Form'!G258","v":0},{"$f":"'Order Form'!H258","v":0},{"$f":"'Order Form'!J258 & \"\"","v":""},{"$f":"'Order Form'!L258 & \"\"","v":""},{"$f":"'Order Form'!C258 & \"\"","v":""},{"$f":"'Order Form'!K258 & \"\"","v":""},{"$f":"'Order Form'!$E$14","v":"YES"},{"$f":"'Order Form'!$E$19","v":0},{"$f":"'Order Form'!$E$16","v":"FREE gift card"},{"$f":"'Order Form'!$E$17","v":"No thanks"},"No","No",{"$f":"\"Dispatch Week: \"&'Order Form'!$E$18","v":"Dispatch Week: "},{"$f":"\"VIP: \"&'Order Form'!$E$5 &\"; Rib: \"&'Order Form'!$E$17 &\"; GT: \"&'Order Form'!$E$16","v":"VIP: ; Rib: No thanks; GT: FREE gift card"},null,null,null,{"$f":"IF(P238=\"\",\"\",IFERROR(INDIRECT(\"Postcodes!$C\"&SUMPRODUCT(--(Postcodes!$A$2:$A$100<=P238)*(Postcodes!$B$2:$B$100>=P238), ROW(Postcodes!$A$2:$A$100))),\"WRONG CODE\"))","v":0},null,null,null,null,null,null,""]
[{"$f":"'Order Form'!A259","v":238},{"$f":"'Order Form'!M259","v":""},{"$f":"'Order Form'!$E$4","v":0},{"$f":"'Order Form'!$E$5","v":0},{"$f":"'Order Form'!$E$6","v":0},{"$f":"'Order Form'!$E$7","v":0},{"$f":"'Order Form'!$E$9","v":0},{"$f":"'Order Form'!$E$8","v":0},{"$f":"'Order Form'!$E$10","v":0},{"$f":"'Order Form'!$E$11","v":0},{"$f":"IF(('Order Form'!$E$15=\"YES\"),'Order Form'!$E$12,\"\")","v":0},{"$f":"'Order Form'!$E$13 & \"\"","v":""},{"$f":"IF('Order Form'!D259=\"\",'Order Form'!C259,'Order Form'!D259) & \"\"","v":""},{"$f":"'Order Form'!E259 & \"\"","v":""},{"$f":"'Order Form'!F259","v":0},{"$f":"'Order Form'!I259","v":0},{"$f":"'Order Form'!G259","v":0},{"$f":"'Order Form'!H259","v":0},{"$f":"'Order Form'!J259 & \"\"","v":""},{"$f":"'Order Form'!L259 & \"\"","v":""},{"$f":"'Order Form'!C259 & \"\"","v":""},{"$f":"'Order Form'!K259 & \"\"","v":""},{"$f":"'Order Form'!$E$14","v":"YES"},{"$f":"'Order Form'!$E$19","v":0},{"$f":"'Order Form'!$E$16","v":"FREE gift card"},{"$f":"'Order Form'!$E$17","v":"No thanks"},"No","No",{"$f":"\"Dispatch Week: \"&'Order Form'!$E$18","v":"Dispatch Week: "},{"$f":"\"VIP: \"&'Order Form'!$E$5 &\"; Rib: \"&'Order Form'!$E$17 &\"; GT: \"&'Order Form'!$E$16","v":"VIP: ; Rib: No thanks; GT: FREE gift card"},null,null,null,{"$f":"IF(P239=\"\",\"\",IFERROR(INDIRECT(\"Postcodes!$C\"&SUMPRODUCT(--(Postcodes!$A$2:$A$100<=P239)*(Postcodes!$B$2:$B$100>=P239), ROW(Postcodes!$A$2:$A$100))),\"WRONG CODE\"))","v":0},null,null,null,null,null,null,""]
[{"$f":"'Order Form'!A260","v":239},{"$f":"'Order Form'!M260","v":""},{"$f":"'Order Form'!$E$4","v":0},{"$f":"'Order Form'!$E$5","v":0},{"$f":"'Order Form'!$E$6","v":0},{"$f":"'Order Form'!$E$7","v":0},{"$f":"'Order Form'!$E$9","v":0},{"$f":"'Order Form'!$E$8","v":0},{"$f":"'Order Form'!$E$10","v":0},{"$f":"'Order Form'!$E$11","v":0},{"$f":"IF(('Order Form'!$E$15=\"YES\"),'Order Form'!$E$12,\"\")","v":0},{"$f":"'Order Form'!$E$13 & \"\"","v":""},{"$f":"IF('Order Form'!D260=\"\",'Order Form'!C260,'Order Form'!D260) & \"\"","v":""},{"$f":"'Order Form'!E260 & \"\"","v":""},{"$f":"'Order Form'!F260","v":0},{"$f":"'Order Form'!I260","v":0},{"$f":"'Order Form'!G260","v":0},{"$f":"'Order Form'!H260","v":0},{"$f":"'Order Form'!J260 & \"\"","v":""},{"$f":"'Order Form'!L260 & \"\"","v":""},{"$f":"'Order Form'!C260 & \"\"","v":""},{"$f":"'Order Form'!K260 & \"\"","v":""},{"$f":"'Order Form'!$E$14","v":"YES"},{"$f":"'Order Form'!$E$19","v":0},{"$f":"'Order Form'!$E$16","v":"FREE gift card"},{"$f":"'Order Form'!$E$17","v":"No thanks"},"No","No",{"$f":"\"Dispatch Week: \"&'Order Form'!$E$18","v":"Dispatch Week: "},{"$f":"\"VIP: \"&'Order Form'!$E$5 &\"; Rib: \"&'Order Form'!$E$17 &\"; GT: \"&'Order Form'!$E$16","v":"VIP: ; Rib: No thanks; GT: FREE gift card"},null,null,null,{"$f":"IF(P240=\"\",\"\",IFERROR(INDIRECT(\"Postcodes!$C\"&SUMPRODUCT(--(Postcodes!$A$2:$A$100<=P240)*(Postcodes!$B$2:$B$100>=P240), ROW(Postcodes!$A$2:$A$100))),\"WRONG CODE\"))","v":0},null,null,null,null,null,null,""]
[{"$f":"'Order Form'!A261","v":240},{"$f":"'Order Form'!M261","v":""},{"$f":"'Order Form'!$E$4","v":0},{"$f":"'Order Form'!$E$5","v":0},{"$f":"'Order Form'!$E$6","v":0},{"$f":"'Order Form'!$E$7","v":0},{"$f":"'Order Form'!$E$9","v":0},{"$f":"'Order Form'!$E$8","v":0},{"$f":"'Order Form'!$E$10","v":0},{"$f":"'Order Form'!$E$11","v":0},{"$f":"IF(('Order Form'!$E$15=\"YES\"),'Order Form'!$E$12,\"\")","v":0},{"$f":"'Order Form'!$E$13 & \"\"","v":""},{"$f":"IF('Order Form'!D261=\"\",'Order Form'!C261,'Order Form'!D261) & \"\"","v":""},{"$f":"'Order Form'!E261 & \"\"","v":""},{"$f":"'Order Form'!F261","v":0},{"$f":"'Order Form'!I261","v":0},{"$f":"'Order Form'!G261","v":0},{"$f":"'Order Form'!H261","v":0},{"$f":"'Order Form'!J261 & \"\"","v":""},{"$f":"'Order Form'!L261 & \"\"","v":""},{"$f":"'Order Form'!C261 & \"\"","v":""},{"$f":"'Order Form'!K261 & \"\"","v":""},{"$f":"'Order Form'!$E$14","v":"YES"},{"$f":"'Order Form'!$E$19","v":0},{"$f":"'Order Form'!$E$16","v":"FREE gift card"},{"$f":"'Order Form'!$E$17","v":"No thanks"},"No","No",{"$f":"\"Dispatch Week: \"&'Order Form'!$E$18","v":"Dispatch Week: "},{"$f":"\"VIP: \"&'Order Form'!$E$5 &\"; Rib: \"&'Order Form'!$E$17 &\"; GT: \"&'Order Form'!$E$16","v":"VIP: ; Rib: No thanks; GT: FREE gift card"},null,null,null,{"$f":"IF(P241=\"\",\"\",IFERROR(INDIRECT(\"Postcodes!$C\"&SUMPRODUCT(--(Postcodes!$A$2:$A$100<=P241)*(Postcodes!$B$2:$B$100>=P241), ROW(Postcodes!$A$2:$A$100))),\"WRONG CODE\"))","v":0},null,null,null,null,null,null,""]
[{"$f":"'Order Form'!A262","v":241},{"$f":"'Order Form'!M262","v":""},{"$f":"'Order Form'!$E$4","v":0},{"$f":"'Order Form'!$E$5","v":0},{"$f":"'Order Form'!$E$6","v":0},{"$f":"'Order Form'!$E$7","v":0},{"$f":"'Order Form'!$E$9","v":0},{"$f":"'Order Form'!$E$8","v":0},{"$f":"'Order Form'!$E$10","v":0},{"$f":"'Order Form'!$E$11","v":0},{"$f":"IF(('Order Form'!$E$15=\"YES\"),'Order Form'!$E$12,\"\")","v":0},{"$f":"'Order Form'!$E$13 & \"\"","v":""},{"$f":"IF('Order Form'!D262=\"\",'Order Form'!C262,'Order Form'!D262) & \"\"","v":""},{"$f":"'Order Form'!E262 & \"\"","v":""},{"$f":"'Order Form'!F262","v":0},{"$f":"'Order Form'!I262","v":0},{"$f":"'Order Form'!G262","v":0},{"$f":"'Order Form'!H262","v":0},{"$f":"'Order Form'!J262 & \"\"","v":""},{"$f":"'Order Form'!L262 & \"\"","v":""},{"$f":"'Order Form'!C262 & \"\"","v":""},{"$f":"'Order Form'!K262 & \"\"","v":""},{"$f":"'Order Form'!$E$14","v":"YES"},{"$f":"'Order Form'!$E$19","v":0},{"$f":"'Order Form'!$E$16","v":"FREE gift card"},{"$f":"'Order Form'!$E$17","v":"No thanks"},"No","No",{"$f":"\"Dispatch Week: \"&'Order Form'!$E$18","v":"Dispatch Week: "},{"$f":"\"VIP: \"&'Order Form'!$E$5 &\"; Rib: \"&'Order Form'!$E$17 &\"; GT: \"&'Order Form'!$E$16","v":"VIP: ; Rib: No thanks; GT: FREE gift card"},null,null,null,{"$f":"IF(P242=\"\",\"\",IFERROR(INDIRECT(\"Postcodes!$C\"&SUMPRODUCT(--(Postcodes!$A$2:$A$100<=P242)*(Postcodes!$B$2:$B$100>=P242), ROW(Postcodes!$A$2:$A$100))),\"WRONG CODE\"))","v":0},null,null,null,null,null,null,""]
[{"$f":"'Order Form'!A263","v":242},{"$f":"'Order Form'!M263","v":""},{"$f":"'Order Form'!$E$4","v":0},{"$f":"'Order Form'!$E$5","v":0},{"$f":"'Order Form'!$E$6","v":0},{"$f":"'Order Form'!$E$7","v":0},{"$f":"'Order Form'!$E$9","v":0},{"$f":"'Order Form'!$E$8","v":0},{"$f":"'Order Form'!$E$10","v":0},{"$f":"'Order Form'!$E$11","v":0},{"$f":"IF(('Order Form'!$E$15=\"YES\"),'Order Form'!$E$12,\"\")","v":0},{"$f":"'Order Form'!$E$13 & \"\"","v":""},{"$f":"IF('Order Form'!D263=\"\",'Order Form'!C263,'Order Form'!D263) & \"\"","v":""},{"$f":"'Order Form'!E263 & \"\"","v":""},{"$f":"'Order Form'!F263","v":0},{"$f":"'Order Form'!I263","v":0},{"$f":"'Order Form'!G263","v":0},{"$f":"'Order Form'!H263","v":0},{"$f":"'Order Form'!J263 & \"\"","v":""},{"$f":"'Order Form'!L263 & \"\"","v":""},{"$f":"'Order Form'!C263 & \"\"","v":""},{"$f":"'Order Form'!K263 & \"\"","v":""},{"$f":"'Order Form'!$E$14","v":"YES"},{"$f":"'Order Form'!$E$19","v":0},{"$f":"'Order Form'!$E$16","v":"FREE gift card"},{"$f":"'Order Form'!$E$17","v":"No thanks"},"No","No",{"$f":"\"Dispatch Week: \"&'Order Form'!$E$18","v":"Dispatch Week: "},{"$f":"\"VIP: \"&'Order Form'!$E$5 &\"; Rib: \"&'Order Form'!$E$17 &\"; GT: \"&'Order Form'!$E$16","v":"VIP: ; Rib: No thanks; GT: FREE gift card"},null,null,null,{"$f":"IF(P243=\"\",\"\",IFERROR(INDIRECT(\"Postcodes!$C\"&SUMPRODUCT(--(Postcodes!$A$2:$A$100<=P243)*(Postcodes!$B$2:$B$100>=P243), ROW(Postcodes!$A$2:$A$100))),\"WRONG CODE\"))","v":0},null,null,null,null,null,null,""]
[{"$f":"'Order Form'!A264","v":243},{"$f":"'Order Form'!M264","v":""},{"$f":"'Order Form'!$E$4","v":0},{"$f":"'Order Form'!$E$5","v":0},{"$f":"'Order Form'!$E$6","v":0},{"$f":"'Order Form'!$E$7","v":0},{"$f":"'Order Form'!$E$9","v":0},{"$f":"'Order Form'!$E$8","v":0},{"$f":"'Order Form'!$E$10","v":0},{"$f":"'Order Form'!$E$11","v":0},{"$f":"IF(('Order Form'!$E$15=\"YES\"),'Order Form'!$E$12,\"\")","v":0},{"$f":"'Order Form'!$E$13 & \"\"","v":""},{"$f":"IF('Order Form'!D264=\"\",'Order Form'!C264,'Order Form'!D264) & \"\"","v":""},{"$f":"'Order Form'!E264 & \"\"","v":""},{"$f":"'Order Form'!F264","v":0},{"$f":"'Order Form'!I264","v":0},{"$f":"'Order Form'!G264","v":0},{"$f":"'Order Form'!H264","v":0},{"$f":"'Order Form'!J264 & \"\"","v":""},{"$f":"'Order Form'!L264 & \"\"","v":""},{"$f":"'Order Form'!C264 & \"\"","v":""},{"$f":"'Order Form'!K264 & \"\"","v":""},{"$f":"'Order Form'!$E$14","v":"YES"},{"$f":"'Order Form'!$E$19","v":0},{"$f":"'Order Form'!$E$16","v":"FREE gift card"},{"$f":"'Order Form'!$E$17","v":"No thanks"},"No","No",{"$f":"\"Dispatch Week: \"&'Order Form'!$E$18","v":"Dispatch Week: "},{"$f":"\"VIP: \"&'Order Form'!$E$5 &\"; Rib: \"&'Order Form'!$E$17 &\"; GT: \"&'Order Form'!$E$16","v":"VIP: ; Rib: No thanks; GT: FREE gift card"},null,null,null,{"$f":"IF(P244=\"\",\"\",IFERROR(INDIRECT(\"Postcodes!$C\"&SUMPRODUCT(--(Postcodes!$A$2:$A$100<=P244)*(Postcodes!$B$2:$B$100>=P244), ROW(Postcodes!$A$2:$A$100))),\"WRONG CODE\"))","v":0},null,null,null,null,null,null,""]
[{"$f":"'Order Form'!A265","v":244},{"$f":"'Order Form'!M265","v":""},{"$f":"'Order Form'!$E$4","v":0},{"$f":"'Order Form'!$E$5","v":0},{"$f":"'Order Form'!$E$6","v":0},{"$f":"'Order Form'!$E$7","v":0},{"$f":"'Order Form'!$E$9","v":0},{"$f":"'Order Form'!$E$8","v":0},{"$f":"'Order Form'!$E$10","v":0},{"$f":"'Order Form'!$E$11","v":0},{"$f":"IF(('Order Form'!$E$15=\"YES\"),'Order Form'!$E$12,\"\")","v":0},{"$f":"'Order Form'!$E$13 & \"\"","v":""},{"$f":"IF('Order Form'!D265=\"\",'Order Form'!C265,'Order Form'!D265) & \"\"","v":""},{"$f":"'Order Form'!E265 & \"\"","v":""},{"$f":"'Order Form'!F265","v":0},{"$f":"'Order Form'!I265","v":0},{"$f":"'Order Form'!G265","v":0},{"$f":"'Order Form'!H265","v":0},{"$f":"'Order Form'!J265 & \"\"","v":""},{"$f":"'Order Form'!L265 & \"\"","v":""},{"$f":"'Order Form'!C265 & \"\"","v":""},{"$f":"'Order Form'!K265 & \"\"","v":""},{"$f":"'Order Form'!$E$14","v":"YES"},{"$f":"'Order Form'!$E$19","v":0},{"$f":"'Order Form'!$E$16","v":"FREE gift card"},{"$f":"'Order Form'!$E$17","v":"No thanks"},"No","No",{"$f":"\"Dispatch Week: \"&'Order Form'!$E$18","v":"Dispatch Week: "},{"$f":"\"VIP: \"&'Order Form'!$E$5 &\"; Rib: \"&'Order Form'!$E$17 &\"; GT: \"&'Order Form'!$E$16","v":"VIP: ; Rib: No thanks; GT: FREE gift card"},null,null,null,{"$f":"IF(P245=\"\",\"\",IFERROR(INDIRECT(\"Postcodes!$C\"&SUMPRODUCT(--(Postcodes!$A$2:$A$100<=P245)*(Postcodes!$B$2:$B$100>=P245), ROW(Postcodes!$A$2:$A$100))),\"WRONG CODE\"))","v":0},null,null,null,null,null,null,""]
[{"$f":"'Order Form'!A266","v":245},{"$f":"'Order Form'!M266","v":""},{"$f":"'Order Form'!$E$4","v":0},{"$f":"'Order Form'!$E$5","v":0},{"$f":"'Order Form'!$E$6","v":0},{"$f":"'Order Form'!$E$7","v":0},{"$f":"'Order Form'!$E$9","v":0},{"$f":"'Order Form'!$E$8","v":0},{"$f":"'Order Form'!$E$10","v":0},{"$f":"'Order Form'!$E$11","v":0},{"$f":"IF(('Order Form'!$E$15=\"YES\"),'Order Form'!$E$12,\"\")","v":0},{"$f":"'Order Form'!$E$13 & \"\"","v":""},{"$f":"IF('Order Form'!D266=\"\",'Order Form'!C266,'Order Form'!D266) & \"\"","v":""},{"$f":"'Order Form'!E266 & \"\"","v":""},{"$f":"'Order Form'!F266","v":0},{"$f":"'Order Form'!I266","v":0},{"$f":"'Order Form'!G266","v":0},{"$f":"'Order Form'!H266","v":0},{"$f":"'Order Form'!J266 & \"\"","v":""},{"$f":"'Order Form'!L266 & \"\"","v":""},{"$f":"'Order Form'!C266 & \"\"","v":""},{"$f":"'Order Form'!K266 & \"\"","v":""},{"$f":"'Order Form'!$E$14","v":"YES"},{"$f":"'Order Form'!$E$19","v":0},{"$f":"'Order Form'!$E$16","v":"FREE gift card"},{"$f":"'Order Form'!$E$17","v":"No thanks"},"No","No",{"$f":"\"Dispatch Week: \"&'Order Form'!$E$18","v":"Dispatch Week: "},{"$f":"\"VIP: \"&'Order Form'!$E$5 &\"; Rib: \"&'Order Form'!$E$17 &\"; GT: \"&'Order Form'!$E$16","v":"VIP: ; Rib: No thanks; GT: FREE gift card"},null,null,null,{"$f":"IF(P246=\"\",\"\",IFERROR(INDIRECT(\"Postcodes!$C\"&SUMPRODUCT(--(Postcodes!$A$2:$A$100<=P246)*(Postcodes!$B$2:$B$100>=P246), ROW(Postcodes!$A$2:$A$100))),\"WRONG CODE\"))","v":0},null,null,null,null,null,null,""]
[{"$f":"'Order Form'!A267","v":246},{"$f":"'Order Form'!M267","v":""},{"$f":"'Order Form'!$E$4","v":0},{"$f":"'Order Form'!$E$5","v":0},{"$f":"'Order Form'!$E$6","v":0},{"$f":"'Order Form'!$E$7","v":0},{"$f":"'Order Form'!$E$9","v":0},{"$f":"'Order Form'!$E$8","v":0},{"$f":"'Order Form'!$E$10","v":0},{"$f":"'Order Form'!$E$11","v":0},{"$f":"IF(('Order Form'!$E$15=\"YES\"),'Order Form'!$E$12,\"\")","v":0},{"$f":"'Order Form'!$E$13 & \"\"","v":""},{"$f":"IF('Order Form'!D267=\"\",'Order Form'!C267,'Order Form'!D267) & \"\"","v":""},{"$f":"'Order Form'!E267 & \"\"","v":""},{"$f":"'Order Form'!F267","v":0},{"$f":"'Order Form'!I267","v":0},{"$f":"'Order Form'!G267","v":0},{"$f":"'Order Form'!H267","v":0},{"$f":"'Order Form'!J267 & \"\"","v":""},{"$f":"'Order Form'!L267 & \"\"","v":""},{"$f":"'Order Form'!C267 & \"\"","v":""},{"$f":"'Order Form'!K267 & \"\"","v":""},{"$f":"'Order Form'!$E$14","v":"YES"},{"$f":"'Order Form'!$E$19","v":0},{"$f":"'Order Form'!$E$16","v":"FREE gift card"},{"$f":"'Order Form'!$E$17","v":"No thanks"},"No","No",{"$f":"\"Dispatch Week: \"&'Order Form'!$E$18","v":"Dispatch Week: "},{"$f":"\"VIP: \"&'Order Form'!$E$5 &\"; Rib: \"&'Order Form'!$E$17 &\"; GT: \"&'Order Form'!$E$16","v":"VIP: ; Rib: No thanks; GT: FREE gift card"},null,null,null,{"$f":"IF(P247=\"\",\"\",IFERROR(INDIRECT(\"Postcodes!$C\"&SUMPRODUCT(--(Postcodes!$A$2:$A$100<=P247)*(Postcodes!$B$2:$B$100>=P247), ROW(Postcodes!$A$2:$A$100))),\"WRONG CODE\"))","v":0},null,null,null,null,null,null,""]
[{"$f":"'Order Form'!A268","v":247},{"$f":"'Order Form'!M268","v":""},{"$f":"'Order Form'!$E$4","v":0},{"$f":"'Order Form'!$E$5","v":0},{"$f":"'Order Form'!$E$6","v":0},{"$f":"'Order Form'!$E$7","v":0},{"$f":"'Order Form'!$E$9","v":0},{"$f":"'Order Form'!$E$8","v":0},{"$f":"'Order Form'!$E$10","v":0},{"$f":"'Order Form'!$E$11","v":0},{"$f":"IF(('Order Form'!$E$15=\"YES\"),'Order Form'!$E$12,\"\")","v":0},{"$f":"'Order Form'!$E$13 & \"\"","v":""},{"$f":"IF('Order Form'!D268=\"\",'Order Form'!C268,'Order Form'!D268) & \"\"","v":""},{"$f":"'Order Form'!E268 & \"\"","v":""},{"$f":"'Order Form'!F268","v":0},{"$f":"'Order Form'!I268","v":0},{"$f":"'Order Form'!G268","v":0},{"$f":"'Order Form'!H268","v":0},{"$f":"'Order Form'!J268 & \"\"","v":""},{"$f":"'Order Form'!L268 & \"\"","v":""},{"$f":"'Order Form'!C268 & \"\"","v":""},{"$f":"'Order Form'!K268 & \"\"","v":""},{"$f":"'Order Form'!$E$14","v":"YES"},{"$f":"'Order Form'!$E$19","v":0},{"$f":"'Order Form'!$E$16","v":"FREE gift card"},{"$f":"'Order Form'!$E$17","v":"No thanks"},"No","No",{"$f":"\"Dispatch Week: \"&'Order Form'!$E$18","v":"Dispatch Week: "},{"$f":"\"VIP: \"&'Order Form'!$E$5 &\"; Rib: \"&'Order Form'!$E$17 &\"; GT: \"&'Order Form'!$E$16","v":"VIP: ; Rib: No thanks; GT: FREE gift card"},null,null,null,{"$f":"IF(P248=\"\",\"\",IFERROR(INDIRECT(\"Postcodes!$C\"&SUMPRODUCT(--(Postcodes!$A$2:$A$100<=P248)*(Postcodes!$B$2:$B$100>=P248), ROW(Postcodes!$A$2:$A$100))),\"WRONG CODE\"))","v":0},null,null,null,null,null,null,""]
[{"$f":"'Order Form'!A269","v":248},{"$f":"'Order Form'!M269","v":""},{"$f":"'Order Form'!$E$4","v":0},{"$f":"'Order Form'!$E$5","v":0},{"$f":"'Order Form'!$E$6","v":0},{"$f":"'Order Form'!$E$7","v":0},{"$f":"'Order Form'!$E$9","v":0},{"$f":"'Order Form'!$E$8","v":0},{"$f":"'Order Form'!$E$10","v":0},{"$f":"'Order Form'!$E$11","v":0},{"$f":"IF(('Order Form'!$E$15=\"YES\"),'Order Form'!$E$12,\"\")","v":0},{"$f":"'Order Form'!$E$13 & \"\"","v":""},{"$f":"IF('Order Form'!D269=\"\",'Order Form'!C269,'Order Form'!D269) & \"\"","v":""},{"$f":"'Order Form'!E269 & \"\"","v":""},{"$f":"'Order Form'!F269","v":0},{"$f":"'Order Form'!I269","v":0},{"$f":"'Order Form'!G269","v":0},{"$f":"'Order Form'!H269","v":0},{"$f":"'Order Form'!J269 & \"\"","v":""},{"$f":"'Order Form'!L269 & \"\"","v":""},{"$f":"'Order Form'!C269 & \"\"","v":""},{"$f":"'Order Form'!K269 & \"\"","v":""},{"$f":"'Order Form'!$E$14","v":"YES"},{"$f":"'Order Form'!$E$19","v":0},{"$f":"'Order Form'!$E$16","v":"FREE gift card"},{"$f":"'Order Form'!$E$17","v":"No thanks"},"No","No",{"$f":"\"Dispatch Week: \"&'Order Form'!$E$18","v":"Dispatch Week: "},{"$f":"\"VIP: \"&'Order Form'!$E$5 &\"; Rib: \"&'Order Form'!$E$17 &\"; GT: \"&'Order Form'!$E$16","v":"VIP: ; Rib: No thanks; GT: FREE gift card"},null,null,null,{"$f":"IF(P249=\"\",\"\",IFERROR(INDIRECT(\"Postcodes!$C\"&SUMPRODUCT(--(Postcodes!$A$2:$A$100<=P249)*(Postcodes!$B$2:$B$100>=P249), ROW(Postcodes!$A$2:$A$100))),\"WRONG CODE\"))","v":0},null,null,null,null,null,null,""]
[{"$f":"'Order Form'!A270","v":249},{"$f":"'Order Form'!M270","v":""},{"$f":"'Order Form'!$E$4","v":0},{"$f":"'Order Form'!$E$5","v":0},{"$f":"'Order Form'!$E$6","v":0},{"$f":"'Order Form'!$E$7","v":0},{"$f":"'Order Form'!$E$9","v":0},{"$f":"'Order Form'!$E$8","v":0},{"$f":"'Order Form'!$E$10","v":0},{"$f":"'Order Form'!$E$11","v":0},{"$f":"IF(('Order Form'!$E$15=\"YES\"),'Order Form'!$E$12,\"\")","v":0},{"$f":"'Order Form'!$E$13 & \"\"","v":""},{"$f":"IF('Order Form'!D270=\"\",'Order Form'!C270,'Order Form'!D270) & \"\"","v":""},{"$f":"'Order Form'!E270 & \"\"","v":""},{"$f":"'Order Form'!F270","v":0},{"$f":"'Order Form'!I270","v":0},{"$f":"'Order Form'!G270","v":0},{"$f":"'Order Form'!H270","v":0},{"$f":"'Order Form'!J270 & \"\"","v":""},{"$f":"'Order Form'!L270 & \"\"","v":""},{"$f":"'Order Form'!C270 & \"\"","v":""},{"$f":"'Order Form'!K270 & \"\"","v":""},{"$f":"'Order Form'!$E$14","v":"YES"},{"$f":"'Order Form'!$E$19","v":0},{"$f":"'Order Form'!$E$16","v":"FREE gift card"},{"$f":"'Order Form'!$E$17","v":"No thanks"},"No","No",{"$f":"\"Dispatch Week: \"&'Order Form'!$E$18","v":"Dispatch Week: "},{"$f":"\"VIP: \"&'Order Form'!$E$5 &\"; Rib: \"&'Order Form'!$E$17 &\"; GT: \"&'Order Form'!$E$16","v":"VIP: ; Rib: No thanks; GT: FREE gift card"},null,null,null,{"$f":"IF(P250=\"\",\"\",IFERROR(INDIRECT(\"Postcodes!$C\"&SUMPRODUCT(--(Postcodes!$A$2:$A$100<=P250)*(Postcodes!$B$2:$B$100>=P250), ROW(Postcodes!$A$2:$A$100))),\"WRONG CODE\"))","v":0},null,null,null,null,null,null,""]
[{"$f":"'Order Form'!A271","v":250},{"$f":"'Order Form'!M271","v":""},{"$f":"'Order Form'!$E$4","v":0},{"$f":"'Order Form'!$E$5","v":0},{"$f":"'Order Form'!$E$6","v":0},{"$f":"'Order Form'!$E$7","v":0},{"$f":"'Order Form'!$E$9","v":0},{"$f":"'Order Form'!$E$8","v":0},{"$f":"'Order Form'!$E$10","v":0},{"$f":"'Order Form'!$E$11","v":0},{"$f":"IF(('Order Form'!$E$15=\"YES\"),'Order Form'!$E$12,\"\")","v":0},{"$f":"'Order Form'!$E$13 & \"\"","v":""},{"$f":"IF('Order Form'!D271=\"\",'Order Form'!C271,'Order Form'!D271) & \"\"","v":""},{"$f":"'Order Form'!E271 & \"\"","v":""},{"$f":"'Order Form'!F271","v":0},{"$f":"'Order Form'!I271","v":0},{"$f":"'Order Form'!G271","v":0},{"$f":"'Order Form'!H271","v":0},{"$f":"'Order Form'!J271 & \"\"","v":""},{"$f":"'Order Form'!L271 & \"\"","v":""},{"$f":"'Order Form'!C271 & \"\"","v":""},{"$f":"'Order Form'!K271 & \"\"","v":""},{"$f":"'Order Form'!$E$14","v":"YES"},{"$f":"'Order Form'!$E$19","v":0},{"$f":"'Order Form'!$E$16","v":"FREE gift card"},{"$f":"'Order Form'!$E$17","v":"No thanks"},"No","No",{"$f":"\"Dispatch Week: \"&'Order Form'!$E$18","v":"Dispatch Week: "},{"$f":"\"VIP: \"&'Order Form'!$E$5 &\"; Rib: \"&'Order Form'!$E$17 &\"; GT: \"&'Order Form'!$E$16","v":"VIP: ; Rib: No thanks; GT: FREE gift card"},null,null,null,{"$f":"IF(P251=\"\",\"\",IFERROR(INDIRECT(\"Postcodes!$C\"&SUMPRODUCT(--(Postcodes!$A$2:$A$100<=P251)*(Postcodes!$B$2:$B$100>=P251), ROW(Postcodes!$A$2:$A$100))),\"WRONG CODE\"))","v":0},null,null,null,null,null,null,""]
[{"$f":"'Order Form'!A272","v":251},{"$f":"'Order Form'!M272","v":""},{"$f":"'Order Form'!$E$4","v":0},{"$f":"'Order Form'!$E$5","v":0},{"$f":"'Order Form'!$E$6","v":0},{"$f":"'Order Form'!$E$7","v":0},{"$f":"'Order Form'!$E$9","v":0},{"$f":"'Order Form'!$E$8","v":0},{"$f":"'Order Form'!$E$10","v":0},{"$f":"'Order Form'!$E$11","v":0},{"$f":"IF(('Order Form'!$E$15=\"YES\"),'Order Form'!$E$12,\"\")","v":0},{"$f":"'Order Form'!$E$13 & \"\"","v":""},{"$f":"IF('Order Form'!D272=\"\",'Order Form'!C272,'Order Form'!D272) & \"\"","v":""},{"$f":"'Order Form'!E272 & \"\"","v":""},{"$f":"'Order Form'!F272","v":0},{"$f":"'Order Form'!I272","v":0},{"$f":"'Order Form'!G272","v":0},{"$f":"'Order Form'!H272","v":0},{"$f":"'Order Form'!J272 & \"\"","v":""},{"$f":"'Order Form'!L272 & \"\"","v":""},{"$f":"'Order Form'!C272 & \"\"","v":""},{"$f":"'Order Form'!K272 & \"\"","v":""},{"$f":"'Order Form'!$E$14","v":"YES"},{"$f":"'Order Form'!$E$19","v":0},{"$f":"'Order Form'!$E$16","v":"FREE gift card"},{"$f":"'Order Form'!$E$17","v":"No thanks"},"No","No",{"$f":"\"Dispatch Week: \"&'Order Form'!$E$18","v":"Dispatch Week: "},{"$f":"\"VIP: \"&'Order Form'!$E$5 &\"; Rib: \"&'Order Form'!$E$17 &\"; GT: \"&'Order Form'!$E$16","v":"VIP: ; Rib: No thanks; GT: FREE gift card"},null,null,null,{"$f":"IF(P252=\"\",\"\",IFERROR(INDIRECT(\"Postcodes!$C\"&SUMPRODUCT(--(Postcodes!$A$2:$A$100<=P252)*(Postcodes!$B$2:$B$100>=P252), ROW(Postcodes!$A$2:$A$100))),\"WRONG CODE\"))","v":0},null,null,null,null,null,null,""]
[{"$f":"'Order Form'!A273","v":252},{"$f":"'Order Form'!M273","v":""},{"$f":"'Order Form'!$E$4","v":0},{"$f":"'Order Form'!$E$5","v":0},{"$f":"'Order Form'!$E$6","v":0},{"$f":"'Order Form'!$E$7","v":0},{"$f":"'Order Form'!$E$9","v":0},{"$f":"'Order Form'!$E$8","v":0},{"$f":"'Order Form'!$E$10","v":0},{"$f":"'Order Form'!$E$11","v":0},{"$f":"IF(('Order Form'!$E$15=\"YES\"),'Order Form'!$E$12,\"\")","v":0},{"$f":"'Order Form'!$E$13 & \"\"","v":""},{"$f":"IF('Order Form'!D273=\"\",'Order Form'!C273,'Order Form'!D273) & \"\"","v":""},{"$f":"'Order Form'!E273 & \"\"","v":""},{"$f":"'Order Form'!F273","v":0},{"$f":"'Order Form'!I273","v":0},{"$f":"'Order Form'!G273","v":0},{"$f":"'Order Form'!H273","v":0},{"$f":"'Order Form'!J273 & \"\"","v":""},{"$f":"'Order Form'!L273 & \"\"","v":""},{"$f":"'Order Form'!C273 & \"\"","v":""},{"$f":"'Order Form'!K273 & \"\"","v":""},{"$f":"'Order Form'!$E$14","v":"YES"},{"$f":"'Order Form'!$E$19","v":0},{"$f":"'Order Form'!$E$16","v":"FREE gift card"},{"$f":"'Order Form'!$E$17","v":"No thanks"},"No","No",{"$f":"\"Dispatch Week: \"&'Order Form'!$E$18","v":"Dispatch Week: "},{"$f":"\"VIP: \"&'Order Form'!$E$5 &\"; Rib: \"&'Order Form'!$E$17 &\"; GT: \"&'Order Form'!$E$16","v":"VIP: ; Rib: No thanks; GT: FREE gift card"},null,null,null,{"$f":"IF(P253=\"\",\"\",IFERROR(INDIRECT(\"Postcodes!$C\"&SUMPRODUCT(--(Postcodes!$A$2:$A$100<=P253)*(Postcodes!$B$2:$B$100>=P253), ROW(Postcodes!$A$2:$A$100))),\"WRONG CODE\"))","v":0},null,null,null,null,null,null,""]
[{"$f":"'Order Form'!A274","v":253},{"$f":"'Order Form'!M274","v":""},{"$f":"'Order Form'!$E$4","v":0},{"$f":"'Order Form'!$E$5","v":0},{"$f":"'Order Form'!$E$6","v":0},{"$f":"'Order Form'!$E$7","v":0},{"$f":"'Order Form'!$E$9","v":0},{"$f":"'Order Form'!$E$8","v":0},{"$f":"'Order Form'!$E$10","v":0},{"$f":"'Order Form'!$E$11","v":0},{"$f":"IF(('Order Form'!$E$15=\"YES\"),'Order Form'!$E$12,\"\")","v":0},{"$f":"'Order Form'!$E$13 & \"\"","v":""},{"$f":"IF('Order Form'!D274=\"\",'Order Form'!C274,'Order Form'!D274) & \"\"","v":""},{"$f":"'Order Form'!E274 & \"\"","v":""},{"$f":"'Order Form'!F274","v":0},{"$f":"'Order Form'!I274","v":0},{"$f":"'Order Form'!G274","v":0},{"$f":"'Order Form'!H274","v":0},{"$f":"'Order Form'!J274 & \"\"","v":""},{"$f":"'Order Form'!L274 & \"\"","v":""},{"$f":"'Order Form'!C274 & \"\"","v":""},{"$f":"'Order Form'!K274 & \"\"","v":""},{"$f":"'Order Form'!$E$14","v":"YES"},{"$f":"'Order Form'!$E$19","v":0},{"$f":"'Order Form'!$E$16","v":"FREE gift card"},{"$f":"'Order Form'!$E$17","v":"No thanks"},"No","No",{"$f":"\"Dispatch Week: \"&'Order Form'!$E$18","v":"Dispatch Week: "},{"$f":"\"VIP: \"&'Order Form'!$E$5 &\"; Rib: \"&'Order Form'!$E$17 &\"; GT: \"&'Order Form'!$E$16","v":"VIP: ; Rib: No thanks; GT: FREE gift card"},null,null,null,{"$f":"IF(P254=\"\",\"\",IFERROR(INDIRECT(\"Postcodes!$C\"&SUMPRODUCT(--(Postcodes!$A$2:$A$100<=P254)*(Postcodes!$B$2:$B$100>=P254), ROW(Postcodes!$A$2:$A$100))),\"WRONG CODE\"))","v":0},null,null,null,null,null,null,""]
[{"$f":"'Order Form'!A275","v":254},{"$f":"'Order Form'!M275","v":""},{"$f":"'Order Form'!$E$4","v":0},{"$f":"'Order Form'!$E$5","v":0},{"$f":"'Order Form'!$E$6","v":0},{"$f":"'Order Form'!$E$7","v":0},{"$f":"'Order Form'!$E$9","v":0},{"$f":"'Order Form'!$E$8","v":0},{"$f":"'Order Form'!$E$10","v":0},{"$f":"'Order Form'!$E$11","v":0},{"$f":"IF(('Order Form'!$E$15=\"YES\"),'Order Form'!$E$12,\"\")","v":0},{"$f":"'Order Form'!$E$13 & \"\"","v":""},{"$f":"IF('Order Form'!D275=\"\",'Order Form'!C275,'Order Form'!D275) & \"\"","v":""},{"$f":"'Order Form'!E275 & \"\"","v":""},{"$f":"'Order Form'!F275","v":0},{"$f":"'Order Form'!I275","v":0},{"$f":"'Order Form'!G275","v":0},{"$f":"'Order Form'!H275","v":0},{"$f":"'Order Form'!J275 & \"\"","v":""},{"$f":"'Order Form'!L275 & \"\"","v":""},{"$f":"'Order Form'!C275 & \"\"","v":""},{"$f":"'Order Form'!K275 & \"\"","v":""},{"$f":"'Order Form'!$E$14","v":"YES"},{"$f":"'Order Form'!$E$19","v":0},{"$f":"'Order Form'!$E$16","v":"FREE gift card"},{"$f":"'Order Form'!$E$17","v":"No thanks"},"No","No",{"$f":"\"Dispatch Week: \"&'Order Form'!$E$18","v":"Dispatch Week: "},{"$f":"\"VIP: \"&'Order Form'!$E$5 &\"; Rib: \"&'Order Form'!$E$17 &\"; GT: \"&'Order Form'!$E$16","v":"VIP: ; Rib: No thanks; GT: FREE gift card"},null,null,null,{"$f":"IF(P255=\"\",\"\",IFERROR(INDIRECT(\"Postcodes!$C\"&SUMPRODUCT(--(Postcodes!$A$2:$A$100<=P255)*(Postcodes!$B$2:$B$100>=P255), ROW(Postcodes!$A$2:$A$100))),\"WRONG CODE\"))","v":0},null,null,null,null,null,null,""]
[{"$f":"'Order Form'!A276","v":255},{"$f":"'Order Form'!M276","v":""},{"$f":"'Order Form'!$E$4","v":0},{"$f":"'Order Form'!$E$5","v":0},{"$f":"'Order Form'!$E$6","v":0},{"$f":"'Order Form'!$E$7","v":0},{"$f":"'Order Form'!$E$9","v":0},{"$f":"'Order Form'!$E$8","v":0},{"$f":"'Order Form'!$E$10","v":0},{"$f":"'Order Form'!$E$11","v":0},{"$f":"IF(('Order Form'!$E$15=\"YES\"),'Order Form'!$E$12,\"\")","v":0},{"$f":"'Order Form'!$E$13 & \"\"","v":""},{"$f":"IF('Order Form'!D276=\"\",'Order Form'!C276,'Order Form'!D276) & \"\"","v":""},{"$f":"'Order Form'!E276 & \"\"","v":""},{"$f":"'Order Form'!F276","v":0},{"$f":"'Order Form'!I276","v":0},{"$f":"'Order Form'!G276","v":0},{"$f":"'Order Form'!H276","v":0},{"$f":"'Order Form'!J276 & \"\"","v":""},{"$f":"'Order Form'!L276 & \"\"","v":""},{"$f":"'Order Form'!C276 & \"\"","v":""},{"$f":"'Order Form'!K276 & \"\"","v":""},{"$f":"'Order Form'!$E$14","v":"YES"},{"$f":"'Order Form'!$E$19","v":0},{"$f":"'Order Form'!$E$16","v":"FREE gift card"},{"$f":"'Order Form'!$E$17","v":"No thanks"},"No","No",{"$f":"\"Dispatch Week: \"&'Order Form'!$E$18","v":"Dispatch Week: "},{"$f":"\"VIP: \"&'Order Form'!$E$5 &\"; Rib: \"&'Order Form'!$E$17 &\"; GT: \"&'Order Form'!$E$16","v":"VIP: ; Rib: No thanks; GT: FREE gift card"},null,null,null,{"$f":"IF(P256=\"\",\"\",IFERROR(INDIRECT(\"Postcodes!$C\"&SUMPRODUCT(--(Postcodes!$A$2:$A$100<=P256)*(Postcodes!$B$2:$B$100>=P256), ROW(Postcodes!$A$2:$A$100))),\"WRONG CODE\"))","v":0},null,null,null,null,null,null,""]
[{"$f":"'Order Form'!A277","v":256},{"$f":"'Order Form'!M277","v":""},{"$f":"'Order Form'!$E$4","v":0},{"$f":"'Order Form'!$E$5","v":0},{"$f":"'Order Form'!$E$6","v":0},{"$f":"'Order Form'!$E$7","v":0},{"$f":"'Order Form'!$E$9","v":0},{"$f":"'Order Form'!$E$8","v":0},{"$f":"'Order Form'!$E$10","v":0},{"$f":"'Order Form'!$E$11","v":0},{"$f":"IF(('Order Form'!$E$15=\"YES\"),'Order Form'!$E$12,\"\")","v":0},{"$f":"'Order Form'!$E$13 & \"\"","v":""},{"$f":"IF('Order Form'!D277=\"\",'Order Form'!C277,'Order Form'!D277) & \"\"","v":""},{"$f":"'Order Form'!E277 & \"\"","v":""},{"$f":"'Order Form'!F277","v":0},{"$f":"'Order Form'!I277","v":0},{"$f":"'Order Form'!G277","v":0},{"$f":"'Order Form'!H277","v":0},{"$f":"'Order Form'!J277 & \"\"","v":""},{"$f":"'Order Form'!L277 & \"\"","v":""},{"$f":"'Order Form'!C277 & \"\"","v":""},{"$f":"'Order Form'!K277 & \"\"","v":""},{"$f":"'Order Form'!$E$14","v":"YES"},{"$f":"'Order Form'!$E$19","v":0},{"$f":"'Order Form'!$E$16","v":"FREE gift card"},{"$f":"'Order Form'!$E$17","v":"No thanks"},"No","No",{"$f":"\"Dispatch Week: \"&'Order Form'!$E$18","v":"Dispatch Week: "},{"$f":"\"VIP: \"&'Order Form'!$E$5 &\"; Rib: \"&'Order Form'!$E$17 &\"; GT: \"&'Order Form'!$E$16","v":"VIP: ; Rib: No thanks; GT: FREE gift card"},null,null,null,{"$f":"IF(P257=\"\",\"\",IFERROR(INDIRECT(\"Postcodes!$C\"&SUMPRODUCT(--(Postcodes!$A$2:$A$100<=P257)*(Postcodes!$B$2:$B$100>=P257), ROW(Postcodes!$A$2:$A$100))),\"WRONG CODE\"))","v":0},null,null,null,null,null,null,""]
[{"$f":"'Order Form'!A278","v":257},{"$f":"'Order Form'!M278","v":""},{"$f":"'Order Form'!$E$4","v":0},{"$f":"'Order Form'!$E$5","v":0},{"$f":"'Order Form'!$E$6","v":0},{"$f":"'Order Form'!$E$7","v":0},{"$f":"'Order Form'!$E$9","v":0},{"$f":"'Order Form'!$E$8","v":0},{"$f":"'Order Form'!$E$10","v":0},{"$f":"'Order Form'!$E$11","v":0},{"$f":"IF(('Order Form'!$E$15=\"YES\"),'Order Form'!$E$12,\"\")","v":0},{"$f":"'Order Form'!$E$13 & \"\"","v":""},{"$f":"IF('Order Form'!D278=\"\",'Order Form'!C278,'Order Form'!D278) & \"\"","v":""},{"$f":"'Order Form'!E278 & \"\"","v":""},{"$f":"'Order Form'!F278","v":0},{"$f":"'Order Form'!I278","v":0},{"$f":"'Order Form'!G278","v":0},{"$f":"'Order Form'!H278","v":0},{"$f":"'Order Form'!J278 & \"\"","v":""},{"$f":"'Order Form'!L278 & \"\"","v":""},{"$f":"'Order Form'!C278 & \"\"","v":""},{"$f":"'Order Form'!K278 & \"\"","v":""},{"$f":"'Order Form'!$E$14","v":"YES"},{"$f":"'Order Form'!$E$19","v":0},{"$f":"'Order Form'!$E$16","v":"FREE gift card"},{"$f":"'Order Form'!$E$17","v":"No thanks"},"No","No",{"$f":"\"Dispatch Week: \"&'Order Form'!$E$18","v":"Dispatch Week: "},{"$f":"\"VIP: \"&'Order Form'!$E$5 &\"; Rib: \"&'Order Form'!$E$17 &\"; GT: \"&'Order Form'!$E$16","v":"VIP: ; Rib: No thanks; GT: FREE gift card"},null,null,null,{"$f":"IF(P258=\"\",\"\",IFERROR(INDIRECT(\"Postcodes!$C\"&SUMPRODUCT(--(Postcodes!$A$2:$A$100<=P258)*(Postcodes!$B$2:$B$100>=P258), ROW(Postcodes!$A$2:$A$100))),\"WRONG CODE\"))","v":0},null,null,null,null,null,null,""]
[{"$f":"'Order Form'!A279","v":258},{"$f":"'Order Form'!M279","v":""},{"$f":"'Order Form'!$E$4","v":0},{"$f":"'Order Form'!$E$5","v":0},{"$f":"'Order Form'!$E$6","v":0},{"$f":"'Order Form'!$E$7","v":0},{"$f":"'Order Form'!$E$9","v":0},{"$f":"'Order Form'!$E$8","v":0},{"$f":"'Order Form'!$E$10","v":0},{"$f":"'Order Form'!$E$11","v":0},{"$f":"IF(('Order Form'!$E$15=\"YES\"),'Order Form'!$E$12,\"\")","v":0},{"$f":"'Order Form'!$E$13 & \"\"","v":""},{"$f":"IF('Order Form'!D279=\"\",'Order Form'!C279,'Order Form'!D279) & \"\"","v":""},{"$f":"'Order Form'!E279 & \"\"","v":""},{"$f":"'Order Form'!F279","v":0},{"$f":"'Order Form'!I279","v":0},{"$f":"'Order Form'!G279","v":0},{"$f":"'Order Form'!H279","v":0},{"$f":"'Order Form'!J279 & \"\"","v":""},{"$f":"'Order Form'!L279 & \"\"","v":""},{"$f":"'Order Form'!C279 & \"\"","v":""},{"$f":"'Order Form'!K279 & \"\"","v":""},{"$f":"'Order Form'!$E$14","v":"YES"},{"$f":"'Order Form'!$E$19","v":0},{"$f":"'Order Form'!$E$16","v":"FREE gift card"},{"$f":"'Order Form'!$E$17","v":"No thanks"},{"$f":"IF(OR(Y259=\"FREE gift card\",Y259=\"No Cards\"),\"No\",\"Yes\")","v":"No"},{"$f":"IF($Z$2=\"No thanks\",\"No\",\"Yes\")","v":"No"},{"$f":"\"Dispatch Week: \"&'Order Form'!$E$18","v":"Dispatch Week: "},{"$f":"\"VIP: \"&'Order Form'!$E$5 &\"; Rib: \"&'Order Form'!$E$17 &\"; GT: \"&'Order Form'!$E$16","v":"VIP: ; Rib: No thanks; GT: FREE gift card"},null,null,null,{"$f":"IF(P259=\"\",\"\",IFERROR(INDIRECT(\"Postcodes!$C\"&SUMPRODUCT(--(Postcodes!$A$2:$A$100<=P259)*(Postcodes!$B$2:$B$100>=P259), ROW(Postcodes!$A$2:$A$100))),\"WRONG CODE\"))","v":0},null,null,null,null,null,null,{"$f":"IF(AND(X259=\"ASAP\",Y259=\"FREE gift card\",Z259=\"No Thanks\"),\"asap\",\"\")","v":""}]
[{"$f":"'Order Form'!A280","v":259},{"$f":"'Order Form'!M280","v":""},{"$f":"'Order Form'!$E$4","v":0},{"$f":"'Order Form'!$E$5","v":0},{"$f":"'Order Form'!$E$6","v":0},{"$f":"'Order Form'!$E$7","v":0},{"$f":"'Order Form'!$E$9","v":0},{"$f":"'Order Form'!$E$8","v":0},{"$f":"'Order Form'!$E$10","v":0},{"$f":"'Order Form'!$E$11","v":0},{"$f":"IF(('Order Form'!$E$15=\"YES\"),'Order Form'!$E$12,\"\")","v":0},{"$f":"'Order Form'!$E$13 & \"\"","v":""},{"$f":"IF('Order Form'!D280=\"\",'Order Form'!C280,'Order Form'!D280) & \"\"","v":""},{"$f":"'Order Form'!E280 & \"\"","v":""},{"$f":"'Order Form'!F280","v":0},{"$f":"'Order Form'!I280","v":0},{"$f":"'Order Form'!G280","v":0},{"$f":"'Order Form'!H280","v":0},{"$f":"'Order Form'!J280 & \"\"","v":""},{"$f":"'Order Form'!L280 & \"\"","v":""},{"$f":"'Order Form'!C280 & \"\"","v":""},{"$f":"'Order Form'!K280 & \"\"","v":""},{"$f":"'Order Form'!$E$14","v":"YES"},{"$f":"'Order Form'!$E$19","v":0},{"$f":"'Order Form'!$E$16","v":"FREE gift card"},{"$f":"'Order Form'!$E$17","v":"No thanks"},"No","No",{"$f":"\"Dispatch Week: \"&'Order Form'!$E$18","v":"Dispatch Week: "},{"$f":"\"VIP: \"&'Order Form'!$E$5 &\"; Rib: \"&'Order Form'!$E$17 &\"; GT: \"&'Order Form'!$E$16","v":"VIP: ; Rib: No thanks; GT: FREE gift card"},null,null,null,{"$f":"IF(P260=\"\",\"\",IFERROR(INDIRECT(\"Postcodes!$C\"&SUMPRODUCT(--(Postcodes!$A$2:$A$100<=P260)*(Postcodes!$B$2:$B$100>=P260), ROW(Postcodes!$A$2:$A$100))),\"WRONG CODE\"))","v":0},null,null,null,null,null,null,""]
[{"$f":"'Order Form'!A281","v":260},{"$f":"'Order Form'!M281","v":""},{"$f":"'Order Form'!$E$4","v":0},{"$f":"'Order Form'!$E$5","v":0},{"$f":"'Order Form'!$E$6","v":0},{"$f":"'Order Form'!$E$7","v":0},{"$f":"'Order Form'!$E$9","v":0},{"$f":"'Order Form'!$E$8","v":0},{"$f":"'Order Form'!$E$10","v":0},{"$f":"'Order Form'!$E$11","v":0},{"$f":"IF(('Order Form'!$E$15=\"YES\"),'Order Form'!$E$12,\"\")","v":0},{"$f":"'Order Form'!$E$13 & \"\"","v":""},{"$f":"IF('Order Form'!D281=\"\",'Order Form'!C281,'Order Form'!D281) & \"\"","v":""},{"$f":"'Order Form'!E281 & \"\"","v":""},{"$f":"'Order Form'!F281","v":0},{"$f":"'Order Form'!I281","v":0},{"$f":"'Order Form'!G281","v":0},{"$f":"'Order Form'!H281","v":0},{"$f":"'Order Form'!J281 & \"\"","v":""},{"$f":"'Order Form'!L281 & \"\"","v":""},{"$f":"'Order Form'!C281 & \"\"","v":""},{"$f":"'Order Form'!K281 & \"\"","v":""},{"$f":"'Order Form'!$E$14","v":"YES"},{"$f":"'Order Form'!$E$19","v":0},{"$f":"'Order Form'!$E$16","v":"FREE gift card"},{"$f":"'Order Form'!$E$17","v":"No thanks"},"No","No",{"$f":"\"Dispatch Week: \"&'Order Form'!$E$18","v":"Dispatch Week: "},{"$f":"\"VIP: \"&'Order Form'!$E$5 &\"; Rib: \"&'Order Form'!$E$17 &\"; GT: \"&'Order Form'!$E$16","v":"VIP: ; Rib: No thanks; GT: FREE gift card"},null,null,null,{"$f":"IF(P261=\"\",\"\",IFERROR(INDIRECT(\"Postcodes!$C\"&SUMPRODUCT(--(Postcodes!$A$2:$A$100<=P261)*(Postcodes!$B$2:$B$100>=P261), ROW(Postcodes!$A$2:$A$100))),\"WRONG CODE\"))","v":0},null,null,null,null,null,null,""]
[{"$f":"'Order Form'!A282","v":261},{"$f":"'Order Form'!M282","v":""},{"$f":"'Order Form'!$E$4","v":0},{"$f":"'Order Form'!$E$5","v":0},{"$f":"'Order Form'!$E$6","v":0},{"$f":"'Order Form'!$E$7","v":0},{"$f":"'Order Form'!$E$9","v":0},{"$f":"'Order Form'!$E$8","v":0},{"$f":"'Order Form'!$E$10","v":0},{"$f":"'Order Form'!$E$11","v":0},{"$f":"IF(('Order Form'!$E$15=\"YES\"),'Order Form'!$E$12,\"\")","v":0},{"$f":"'Order Form'!$E$13 & \"\"","v":""},{"$f":"IF('Order Form'!D282=\"\",'Order Form'!C282,'Order Form'!D282) & \"\"","v":""},{"$f":"'Order Form'!E282 & \"\"","v":""},{"$f":"'Order Form'!F282","v":0},{"$f":"'Order Form'!I282","v":0},{"$f":"'Order Form'!G282","v":0},{"$f":"'Order Form'!H282","v":0},{"$f":"'Order Form'!J282 & \"\"","v":""},{"$f":"'Order Form'!L282 & \"\"","v":""},{"$f":"'Order Form'!C282 & \"\"","v":""},{"$f":"'Order Form'!K282 & \"\"","v":""},{"$f":"'Order Form'!$E$14","v":"YES"},{"$f":"'Order Form'!$E$19","v":0},{"$f":"'Order Form'!$E$16","v":"FREE gift card"},{"$f":"'Order Form'!$E$17","v":"No thanks"},"No","No",{"$f":"\"Dispatch Week: \"&'Order Form'!$E$18","v":"Dispatch Week: "},{"$f":"\"VIP: \"&'Order Form'!$E$5 &\"; Rib: \"&'Order Form'!$E$17 &\"; GT: \"&'Order Form'!$E$16","v":"VIP: ; Rib: No thanks; GT: FREE gift card"},null,null,null,{"$f":"IF(P262=\"\",\"\",IFERROR(INDIRECT(\"Postcodes!$C\"&SUMPRODUCT(--(Postcodes!$A$2:$A$100<=P262)*(Postcodes!$B$2:$B$100>=P262), ROW(Postcodes!$A$2:$A$100))),\"WRONG CODE\"))","v":0},null,null,null,null,null,null,""]
[{"$f":"'Order Form'!A283","v":262},{"$f":"'Order Form'!M283","v":""},{"$f":"'Order Form'!$E$4","v":0},{"$f":"'Order Form'!$E$5","v":0},{"$f":"'Order Form'!$E$6","v":0},{"$f":"'Order Form'!$E$7","v":0},{"$f":"'Order Form'!$E$9","v":0},{"$f":"'Order Form'!$E$8","v":0},{"$f":"'Order Form'!$E$10","v":0},{"$f":"'Order Form'!$E$11","v":0},{"$f":"IF(('Order Form'!$E$15=\"YES\"),'Order Form'!$E$12,\"\")","v":0},{"$f":"'Order Form'!$E$13 & \"\"","v":""},{"$f":"IF('Order Form'!D283=\"\",'Order Form'!C283,'Order Form'!D283) & \"\"","v":""},{"$f":"'Order Form'!E283 & \"\"","v":""},{"$f":"'Order Form'!F283","v":0},{"$f":"'Order Form'!I283","v":0},{"$f":"'Order Form'!G283","v":0},{"$f":"'Order Form'!H283","v":0},{"$f":"'Order Form'!J283 & \"\"","v":""},{"$f":"'Order Form'!L283 & \"\"","v":""},{"$f":"'Order Form'!C283 & \"\"","v":""},{"$f":"'Order Form'!K283 & \"\"","v":""},{"$f":"'Order Form'!$E$14","v":"YES"},{"$f":"'Order Form'!$E$19","v":0},{"$f":"'Order Form'!$E$16","v":"FREE gift card"},{"$f":"'Order Form'!$E$17","v":"No thanks"},"No","No",{"$f":"\"Dispatch Week: \"&'Order Form'!$E$18","v":"Dispatch Week: "},{"$f":"\"VIP: \"&'Order Form'!$E$5 &\"; Rib: \"&'Order Form'!$E$17 &\"; GT: \"&'Order Form'!$E$16","v":"VIP: ; Rib: No thanks; GT: FREE gift card"},null,null,null,{"$f":"IF(P263=\"\",\"\",IFERROR(INDIRECT(\"Postcodes!$C\"&SUMPRODUCT(--(Postcodes!$A$2:$A$100<=P263)*(Postcodes!$B$2:$B$100>=P263), ROW(Postcodes!$A$2:$A$100))),\"WRONG CODE\"))","v":0},null,null,null,null,null,null,""]
[{"$f":"'Order Form'!A284","v":263},{"$f":"'Order Form'!M284","v":""},{"$f":"'Order Form'!$E$4","v":0},{"$f":"'Order Form'!$E$5","v":0},{"$f":"'Order Form'!$E$6","v":0},{"$f":"'Order Form'!$E$7","v":0},{"$f":"'Order Form'!$E$9","v":0},{"$f":"'Order Form'!$E$8","v":0},{"$f":"'Order Form'!$E$10","v":0},{"$f":"'Order Form'!$E$11","v":0},{"$f":"IF(('Order Form'!$E$15=\"YES\"),'Order Form'!$E$12,\"\")","v":0},{"$f":"'Order Form'!$E$13 & \"\"","v":""},{"$f":"IF('Order Form'!D284=\"\",'Order Form'!C284,'Order Form'!D284) & \"\"","v":""},{"$f":"'Order Form'!E284 & \"\"","v":""},{"$f":"'Order Form'!F284","v":0},{"$f":"'Order Form'!I284","v":0},{"$f":"'Order Form'!G284","v":0},{"$f":"'Order Form'!H284","v":0},{"$f":"'Order Form'!J284 & \"\"","v":""},{"$f":"'Order Form'!L284 & \"\"","v":""},{"$f":"'Order Form'!C284 & \"\"","v":""},{"$f":"'Order Form'!K284 & \"\"","v":""},{"$f":"'Order Form'!$E$14","v":"YES"},{"$f":"'Order Form'!$E$19","v":0},{"$f":"'Order Form'!$E$16","v":"FREE gift card"},{"$f":"'Order Form'!$E$17","v":"No thanks"},"No","No",{"$f":"\"Dispatch Week: \"&'Order Form'!$E$18","v":"Dispatch Week: "},{"$f":"\"VIP: \"&'Order Form'!$E$5 &\"; Rib: \"&'Order Form'!$E$17 &\"; GT: \"&'Order Form'!$E$16","v":"VIP: ; Rib: No thanks; GT: FREE gift card"},null,null,null,{"$f":"IF(P264=\"\",\"\",IFERROR(INDIRECT(\"Postcodes!$C\"&SUMPRODUCT(--(Postcodes!$A$2:$A$100<=P264)*(Postcodes!$B$2:$B$100>=P264), ROW(Postcodes!$A$2:$A$100))),\"WRONG CODE\"))","v":0},null,null,null,null,null,null,""]
[{"$f":"'Order Form'!A285","v":264},{"$f":"'Order Form'!M285","v":""},{"$f":"'Order Form'!$E$4","v":0},{"$f":"'Order Form'!$E$5","v":0},{"$f":"'Order Form'!$E$6","v":0},{"$f":"'Order Form'!$E$7","v":0},{"$f":"'Order Form'!$E$9","v":0},{"$f":"'Order Form'!$E$8","v":0},{"$f":"'Order Form'!$E$10","v":0},{"$f":"'Order Form'!$E$11","v":0},{"$f":"IF(('Order Form'!$E$15=\"YES\"),'Order Form'!$E$12,\"\")","v":0},{"$f":"'Order Form'!$E$13 & \"\"","v":""},{"$f":"IF('Order Form'!D285=\"\",'Order Form'!C285,'Order Form'!D285) & \"\"","v":""},{"$f":"'Order Form'!E285 & \"\"","v":""},{"$f":"'Order Form'!F285","v":0},{"$f":"'Order Form'!I285","v":0},{"$f":"'Order Form'!G285","v":0},{"$f":"'Order Form'!H285","v":0},{"$f":"'Order Form'!J285 & \"\"","v":""},{"$f":"'Order Form'!L285 & \"\"","v":""},{"$f":"'Order Form'!C285 & \"\"","v":""},{"$f":"'Order Form'!K285 & \"\"","v":""},{"$f":"'Order Form'!$E$14","v":"YES"},{"$f":"'Order Form'!$E$19","v":0},{"$f":"'Order Form'!$E$16","v":"FREE gift card"},{"$f":"'Order Form'!$E$17","v":"No thanks"},"No","No",{"$f":"\"Dispatch Week: \"&'Order Form'!$E$18","v":"Dispatch Week: "},{"$f":"\"VIP: \"&'Order Form'!$E$5 &\"; Rib: \"&'Order Form'!$E$17 &\"; GT: \"&'Order Form'!$E$16","v":"VIP: ; Rib: No thanks; GT: FREE gift card"},null,null,null,{"$f":"IF(P265=\"\",\"\",IFERROR(INDIRECT(\"Postcodes!$C\"&SUMPRODUCT(--(Postcodes!$A$2:$A$100<=P265)*(Postcodes!$B$2:$B$100>=P265), ROW(Postcodes!$A$2:$A$100))),\"WRONG CODE\"))","v":0},null,null,null,null,null,null,""]
[{"$f":"'Order Form'!A286","v":265},{"$f":"'Order Form'!M286","v":""},{"$f":"'Order Form'!$E$4","v":0},{"$f":"'Order Form'!$E$5","v":0},{"$f":"'Order Form'!$E$6","v":0},{"$f":"'Order Form'!$E$7","v":0},{"$f":"'Order Form'!$E$9","v":0},{"$f":"'Order Form'!$E$8","v":0},{"$f":"'Order Form'!$E$10","v":0},{"$f":"'Order Form'!$E$11","v":0},{"$f":"IF(('Order Form'!$E$15=\"YES\"),'Order Form'!$E$12,\"\")","v":0},{"$f":"'Order Form'!$E$13 & \"\"","v":""},{"$f":"IF('Order Form'!D286=\"\",'Order Form'!C286,'Order Form'!D286) & \"\"","v":""},{"$f":"'Order Form'!E286 & \"\"","v":""},{"$f":"'Order Form'!F286","v":0},{"$f":"'Order Form'!I286","v":0},{"$f":"'Order Form'!G286","v":0},{"$f":"'Order Form'!H286","v":0},{"$f":"'Order Form'!J286 & \"\"","v":""},{"$f":"'Order Form'!L286 & \"\"","v":""},{"$f":"'Order Form'!C286 & \"\"","v":""},{"$f":"'Order Form'!K286 & \"\"","v":""},{"$f":"'Order Form'!$E$14","v":"YES"},{"$f":"'Order Form'!$E$19","v":0},{"$f":"'Order Form'!$E$16","v":"FREE gift card"},{"$f":"'Order Form'!$E$17","v":"No thanks"},"No","No",{"$f":"\"Dispatch Week: \"&'Order Form'!$E$18","v":"Dispatch Week: "},{"$f":"\"VIP: \"&'Order Form'!$E$5 &\"; Rib: \"&'Order Form'!$E$17 &\"; GT: \"&'Order Form'!$E$16","v":"VIP: ; Rib: No thanks; GT: FREE gift card"},null,null,null,{"$f":"IF(P266=\"\",\"\",IFERROR(INDIRECT(\"Postcodes!$C\"&SUMPRODUCT(--(Postcodes!$A$2:$A$100<=P266)*(Postcodes!$B$2:$B$100>=P266), ROW(Postcodes!$A$2:$A$100))),\"WRONG CODE\"))","v":0},null,null,null,null,null,null,""]
[{"$f":"'Order Form'!A287","v":266},{"$f":"'Order Form'!M287","v":""},{"$f":"'Order Form'!$E$4","v":0},{"$f":"'Order Form'!$E$5","v":0},{"$f":"'Order Form'!$E$6","v":0},{"$f":"'Order Form'!$E$7","v":0},{"$f":"'Order Form'!$E$9","v":0},{"$f":"'Order Form'!$E$8","v":0},{"$f":"'Order Form'!$E$10","v":0},{"$f":"'Order Form'!$E$11","v":0},{"$f":"IF(('Order Form'!$E$15=\"YES\"),'Order Form'!$E$12,\"\")","v":0},{"$f":"'Order Form'!$E$13 & \"\"","v":""},{"$f":"IF('Order Form'!D287=\"\",'Order Form'!C287,'Order Form'!D287) & \"\"","v":""},{"$f":"'Order Form'!E287 & \"\"","v":""},{"$f":"'Order Form'!F287","v":0},{"$f":"'Order Form'!I287","v":0},{"$f":"'Order Form'!G287","v":0},{"$f":"'Order Form'!H287","v":0},{"$f":"'Order Form'!J287 & \"\"","v":""},{"$f":"'Order Form'!L287 & \"\"","v":""},{"$f":"'Order Form'!C287 & \"\"","v":""},{"$f":"'Order Form'!K287 & \"\"","v":""},{"$f":"'Order Form'!$E$14","v":"YES"},{"$f":"'Order Form'!$E$19","v":0},{"$f":"'Order Form'!$E$16","v":"FREE gift card"},{"$f":"'Order Form'!$E$17","v":"No thanks"},"No","No",{"$f":"\"Dispatch Week: \"&'Order Form'!$E$18","v":"Dispatch Week: "},{"$f":"\"VIP: \"&'Order Form'!$E$5 &\"; Rib: \"&'Order Form'!$E$17 &\"; GT: \"&'Order Form'!$E$16","v":"VIP: ; Rib: No thanks; GT: FREE gift card"},null,null,null,{"$f":"IF(P267=\"\",\"\",IFERROR(INDIRECT(\"Postcodes!$C\"&SUMPRODUCT(--(Postcodes!$A$2:$A$100<=P267)*(Postcodes!$B$2:$B$100>=P267), ROW(Postcodes!$A$2:$A$100))),\"WRONG CODE\"))","v":0},null,null,null,null,null,null,""]
[{"$f":"'Order Form'!A288","v":267},{"$f":"'Order Form'!M288","v":""},{"$f":"'Order Form'!$E$4","v":0},{"$f":"'Order Form'!$E$5","v":0},{"$f":"'Order Form'!$E$6","v":0},{"$f":"'Order Form'!$E$7","v":0},{"$f":"'Order Form'!$E$9","v":0},{"$f":"'Order Form'!$E$8","v":0},{"$f":"'Order Form'!$E$10","v":0},{"$f":"'Order Form'!$E$11","v":0},{"$f":"IF(('Order Form'!$E$15=\"YES\"),'Order Form'!$E$12,\"\")","v":0},{"$f":"'Order Form'!$E$13 & \"\"","v":""},{"$f":"IF('Order Form'!D288=\"\",'Order Form'!C288,'Order Form'!D288) & \"\"","v":""},{"$f":"'Order Form'!E288 & \"\"","v":""},{"$f":"'Order Form'!F288","v":0},{"$f":"'Order Form'!I288","v":0},{"$f":"'Order Form'!G288","v":0},{"$f":"'Order Form'!H288","v":0},{"$f":"'Order Form'!J288 & \"\"","v":""},{"$f":"'Order Form'!L288 & \"\"","v":""},{"$f":"'Order Form'!C288 & \"\"","v":""},{"$f":"'Order Form'!K288 & \"\"","v":""},{"$f":"'Order Form'!$E$14","v":"YES"},{"$f":"'Order Form'!$E$19","v":0},{"$f":"'Order Form'!$E$16","v":"FREE gift card"},{"$f":"'Order Form'!$E$17","v":"No thanks"},"No","No",{"$f":"\"Dispatch Week: \"&'Order Form'!$E$18","v":"Dispatch Week: "},{"$f":"\"VIP: \"&'Order Form'!$E$5 &\"; Rib: \"&'Order Form'!$E$17 &\"; GT: \"&'Order Form'!$E$16","v":"VIP: ; Rib: No thanks; GT: FREE gift card"},null,null,null,{"$f":"IF(P268=\"\",\"\",IFERROR(INDIRECT(\"Postcodes!$C\"&SUMPRODUCT(--(Postcodes!$A$2:$A$100<=P268)*(Postcodes!$B$2:$B$100>=P268), ROW(Postcodes!$A$2:$A$100))),\"WRONG CODE\"))","v":0},null,null,null,null,null,null,""]
[{"$f":"'Order Form'!A289","v":268},{"$f":"'Order Form'!M289","v":""},{"$f":"'Order Form'!$E$4","v":0},{"$f":"'Order Form'!$E$5","v":0},{"$f":"'Order Form'!$E$6","v":0},{"$f":"'Order Form'!$E$7","v":0},{"$f":"'Order Form'!$E$9","v":0},{"$f":"'Order Form'!$E$8","v":0},{"$f":"'Order Form'!$E$10","v":0},{"$f":"'Order Form'!$E$11","v":0},{"$f":"IF(('Order Form'!$E$15=\"YES\"),'Order Form'!$E$12,\"\")","v":0},{"$f":"'Order Form'!$E$13 & \"\"","v":""},{"$f":"IF('Order Form'!D289=\"\",'Order Form'!C289,'Order Form'!D289) & \"\"","v":""},{"$f":"'Order Form'!E289 & \"\"","v":""},{"$f":"'Order Form'!F289","v":0},{"$f":"'Order Form'!I289","v":0},{"$f":"'Order Form'!G289","v":0},{"$f":"'Order Form'!H289","v":0},{"$f":"'Order Form'!J289 & \"\"","v":""},{"$f":"'Order Form'!L289 & \"\"","v":""},{"$f":"'Order Form'!C289 & \"\"","v":""},{"$f":"'Order Form'!K289 & \"\"","v":""},{"$f":"'Order Form'!$E$14","v":"YES"},{"$f":"'Order Form'!$E$19","v":0},{"$f":"'Order Form'!$E$16","v":"FREE gift card"},{"$f":"'Order Form'!$E$17","v":"No thanks"},"No","No",{"$f":"\"Dispatch Week: \"&'Order Form'!$E$18","v":"Dispatch Week: "},{"$f":"\"VIP: \"&'Order Form'!$E$5 &\"; Rib: \"&'Order Form'!$E$17 &\"; GT: \"&'Order Form'!$E$16","v":"VIP: ; Rib: No thanks; GT: FREE gift card"},null,null,null,{"$f":"IF(P269=\"\",\"\",IFERROR(INDIRECT(\"Postcodes!$C\"&SUMPRODUCT(--(Postcodes!$A$2:$A$100<=P269)*(Postcodes!$B$2:$B$100>=P269), ROW(Postcodes!$A$2:$A$100))),\"WRONG CODE\"))","v":0},null,null,null,null,null,null,""]
[{"$f":"'Order Form'!A290","v":269},{"$f":"'Order Form'!M290","v":""},{"$f":"'Order Form'!$E$4","v":0},{"$f":"'Order Form'!$E$5","v":0},{"$f":"'Order Form'!$E$6","v":0},{"$f":"'Order Form'!$E$7","v":0},{"$f":"'Order Form'!$E$9","v":0},{"$f":"'Order Form'!$E$8","v":0},{"$f":"'Order Form'!$E$10","v":0},{"$f":"'Order Form'!$E$11","v":0},{"$f":"IF(('Order Form'!$E$15=\"YES\"),'Order Form'!$E$12,\"\")","v":0},{"$f":"'Order Form'!$E$13 & \"\"","v":""},{"$f":"IF('Order Form'!D290=\"\",'Order Form'!C290,'Order Form'!D290) & \"\"","v":""},{"$f":"'Order Form'!E290 & \"\"","v":""},{"$f":"'Order Form'!F290","v":0},{"$f":"'Order Form'!I290","v":0},{"$f":"'Order Form'!G290","v":0},{"$f":"'Order Form'!H290","v":0},{"$f":"'Order Form'!J290 & \"\"","v":""},{"$f":"'Order Form'!L290 & \"\"","v":""},{"$f":"'Order Form'!C290 & \"\"","v":""},{"$f":"'Order Form'!K290 & \"\"","v":""},{"$f":"'Order Form'!$E$14","v":"YES"},{"$f":"'Order Form'!$E$19","v":0},{"$f":"'Order Form'!$E$16","v":"FREE gift card"},{"$f":"'Order Form'!$E$17","v":"No thanks"},"No","No",{"$f":"\"Dispatch Week: \"&'Order Form'!$E$18","v":"Dispatch Week: "},{"$f":"\"VIP: \"&'Order Form'!$E$5 &\"; Rib: \"&'Order Form'!$E$17 &\"; GT: \"&'Order Form'!$E$16","v":"VIP: ; Rib: No thanks; GT: FREE gift card"},null,null,null,{"$f":"IF(P270=\"\",\"\",IFERROR(INDIRECT(\"Postcodes!$C\"&SUMPRODUCT(--(Postcodes!$A$2:$A$100<=P270)*(Postcodes!$B$2:$B$100>=P270), ROW(Postcodes!$A$2:$A$100))),\"WRONG CODE\"))","v":0},null,null,null,null,null,null,""]
[{"$f":"'Order Form'!A291","v":270},{"$f":"'Order Form'!M291","v":""},{"$f":"'Order Form'!$E$4","v":0},{"$f":"'Order Form'!$E$5","v":0},{"$f":"'Order Form'!$E$6","v":0},{"$f":"'Order Form'!$E$7","v":0},{"$f":"'Order Form'!$E$9","v":0},{"$f":"'Order Form'!$E$8","v":0},{"$f":"'Order Form'!$E$10","v":0},{"$f":"'Order Form'!$E$11","v":0},{"$f":"IF(('Order Form'!$E$15=\"YES\"),'Order Form'!$E$12,\"\")","v":0},{"$f":"'Order Form'!$E$13 & \"\"","v":""},{"$f":"IF('Order Form'!D291=\"\",'Order Form'!C291,'Order Form'!D291) & \"\"","v":""},{"$f":"'Order Form'!E291 & \"\"","v":""},{"$f":"'Order Form'!F291","v":0},{"$f":"'Order Form'!I291","v":0},{"$f":"'Order Form'!G291","v":0},{"$f":"'Order Form'!H291","v":0},{"$f":"'Order Form'!J291 & \"\"","v":""},{"$f":"'Order Form'!L291 & \"\"","v":""},{"$f":"'Order Form'!C291 & \"\"","v":""},{"$f":"'Order Form'!K291 & \"\"","v":""},{"$f":"'Order Form'!$E$14","v":"YES"},{"$f":"'Order Form'!$E$19","v":0},{"$f":"'Order Form'!$E$16","v":"FREE gift card"},{"$f":"'Order Form'!$E$17","v":"No thanks"},"No","No",{"$f":"\"Dispatch Week: \"&'Order Form'!$E$18","v":"Dispatch Week: "},{"$f":"\"VIP: \"&'Order Form'!$E$5 &\"; Rib: \"&'Order Form'!$E$17 &\"; GT: \"&'Order Form'!$E$16","v":"VIP: ; Rib: No thanks; GT: FREE gift card"},null,null,null,{"$f":"IF(P271=\"\",\"\",IFERROR(INDIRECT(\"Postcodes!$C\"&SUMPRODUCT(--(Postcodes!$A$2:$A$100<=P271)*(Postcodes!$B$2:$B$100>=P271), ROW(Postcodes!$A$2:$A$100))),\"WRONG CODE\"))","v":0},null,null,null,null,null,null,""]
[{"$f":"'Order Form'!A292","v":271},{"$f":"'Order Form'!M292","v":""},{"$f":"'Order Form'!$E$4","v":0},{"$f":"'Order Form'!$E$5","v":0},{"$f":"'Order Form'!$E$6","v":0},{"$f":"'Order Form'!$E$7","v":0},{"$f":"'Order Form'!$E$9","v":0},{"$f":"'Order Form'!$E$8","v":0},{"$f":"'Order Form'!$E$10","v":0},{"$f":"'Order Form'!$E$11","v":0},{"$f":"IF(('Order Form'!$E$15=\"YES\"),'Order Form'!$E$12,\"\")","v":0},{"$f":"'Order Form'!$E$13 & \"\"","v":""},{"$f":"IF('Order Form'!D292=\"\",'Order Form'!C292,'Order Form'!D292) & \"\"","v":""},{"$f":"'Order Form'!E292 & \"\"","v":""},{"$f":"'Order Form'!F292","v":0},{"$f":"'Order Form'!I292","v":0},{"$f":"'Order Form'!G292","v":0},{"$f":"'Order Form'!H292","v":0},{"$f":"'Order Form'!J292 & \"\"","v":""},{"$f":"'Order Form'!L292 & \"\"","v":""},{"$f":"'Order Form'!C292 & \"\"","v":""},{"$f":"'Order Form'!K292 & \"\"","v":""},{"$f":"'Order Form'!$E$14","v":"YES"},{"$f":"'Order Form'!$E$19","v":0},{"$f":"'Order Form'!$E$16","v":"FREE gift card"},{"$f":"'Order Form'!$E$17","v":"No thanks"},"No","No",{"$f":"\"Dispatch Week: \"&'Order Form'!$E$18","v":"Dispatch Week: "},{"$f":"\"VIP: \"&'Order Form'!$E$5 &\"; Rib: \"&'Order Form'!$E$17 &\"; GT: \"&'Order Form'!$E$16","v":"VIP: ; Rib: No thanks; GT: FREE gift card"},null,null,null,{"$f":"IF(P272=\"\",\"\",IFERROR(INDIRECT(\"Postcodes!$C\"&SUMPRODUCT(--(Postcodes!$A$2:$A$100<=P272)*(Postcodes!$B$2:$B$100>=P272), ROW(Postcodes!$A$2:$A$100))),\"WRONG CODE\"))","v":0},null,null,null,null,null,null,""]
[{"$f":"'Order Form'!A293","v":272},{"$f":"'Order Form'!M293","v":""},{"$f":"'Order Form'!$E$4","v":0},{"$f":"'Order Form'!$E$5","v":0},{"$f":"'Order Form'!$E$6","v":0},{"$f":"'Order Form'!$E$7","v":0},{"$f":"'Order Form'!$E$9","v":0},{"$f":"'Order Form'!$E$8","v":0},{"$f":"'Order Form'!$E$10","v":0},{"$f":"'Order Form'!$E$11","v":0},{"$f":"IF(('Order Form'!$E$15=\"YES\"),'Order Form'!$E$12,\"\")","v":0},{"$f":"'Order Form'!$E$13 & \"\"","v":""},{"$f":"IF('Order Form'!D293=\"\",'Order Form'!C293,'Order Form'!D293) & \"\"","v":""},{"$f":"'Order Form'!E293 & \"\"","v":""},{"$f":"'Order Form'!F293","v":0},{"$f":"'Order Form'!I293","v":0},{"$f":"'Order Form'!G293","v":0},{"$f":"'Order Form'!H293","v":0},{"$f":"'Order Form'!J293 & \"\"","v":""},{"$f":"'Order Form'!L293 & \"\"","v":""},{"$f":"'Order Form'!C293 & \"\"","v":""},{"$f":"'Order Form'!K293 & \"\"","v":""},{"$f":"'Order Form'!$E$14","v":"YES"},{"$f":"'Order Form'!$E$19","v":0},{"$f":"'Order Form'!$E$16","v":"FREE gift card"},{"$f":"'Order Form'!$E$17","v":"No thanks"},"No","No",{"$f":"\"Dispatch Week: \"&'Order Form'!$E$18","v":"Dispatch Week: "},{"$f":"\"VIP: \"&'Order Form'!$E$5 &\"; Rib: \"&'Order Form'!$E$17 &\"; GT: \"&'Order Form'!$E$16","v":"VIP: ; Rib: No thanks; GT: FREE gift card"},null,null,null,{"$f":"IF(P273=\"\",\"\",IFERROR(INDIRECT(\"Postcodes!$C\"&SUMPRODUCT(--(Postcodes!$A$2:$A$100<=P273)*(Postcodes!$B$2:$B$100>=P273), ROW(Postcodes!$A$2:$A$100))),\"WRONG CODE\"))","v":0},null,null,null,null,null,null,""]
[{"$f":"'Order Form'!A294","v":273},{"$f":"'Order Form'!M294","v":""},{"$f":"'Order Form'!$E$4","v":0},{"$f":"'Order Form'!$E$5","v":0},{"$f":"'Order Form'!$E$6","v":0},{"$f":"'Order Form'!$E$7","v":0},{"$f":"'Order Form'!$E$9","v":0},{"$f":"'Order Form'!$E$8","v":0},{"$f":"'Order Form'!$E$10","v":0},{"$f":"'Order Form'!$E$11","v":0},{"$f":"IF(('Order Form'!$E$15=\"YES\"),'Order Form'!$E$12,\"\")","v":0},{"$f":"'Order Form'!$E$13 & \"\"","v":""},{"$f":"IF('Order Form'!D294=\"\",'Order Form'!C294,'Order Form'!D294) & \"\"","v":""},{"$f":"'Order Form'!E294 & \"\"","v":""},{"$f":"'Order Form'!F294","v":0},{"$f":"'Order Form'!I294","v":0},{"$f":"'Order Form'!G294","v":0},{"$f":"'Order Form'!H294","v":0},{"$f":"'Order Form'!J294 & \"\"","v":""},{"$f":"'Order Form'!L294 & \"\"","v":""},{"$f":"'Order Form'!C294 & \"\"","v":""},{"$f":"'Order Form'!K294 & \"\"","v":""},{"$f":"'Order Form'!$E$14","v":"YES"},{"$f":"'Order Form'!$E$19","v":0},{"$f":"'Order Form'!$E$16","v":"FREE gift card"},{"$f":"'Order Form'!$E$17","v":"No thanks"},"No","No",{"$f":"\"Dispatch Week: \"&'Order Form'!$E$18","v":"Dispatch Week: "},{"$f":"\"VIP: \"&'Order Form'!$E$5 &\"; Rib: \"&'Order Form'!$E$17 &\"; GT: \"&'Order Form'!$E$16","v":"VIP: ; Rib: No thanks; GT: FREE gift card"},null,null,null,{"$f":"IF(P274=\"\",\"\",IFERROR(INDIRECT(\"Postcodes!$C\"&SUMPRODUCT(--(Postcodes!$A$2:$A$100<=P274)*(Postcodes!$B$2:$B$100>=P274), ROW(Postcodes!$A$2:$A$100))),\"WRONG CODE\"))","v":0},null,null,null,null,null,null,""]
[{"$f":"'Order Form'!A295","v":274},{"$f":"'Order Form'!M295","v":""},{"$f":"'Order Form'!$E$4","v":0},{"$f":"'Order Form'!$E$5","v":0},{"$f":"'Order Form'!$E$6","v":0},{"$f":"'Order Form'!$E$7","v":0},{"$f":"'Order Form'!$E$9","v":0},{"$f":"'Order Form'!$E$8","v":0},{"$f":"'Order Form'!$E$10","v":0},{"$f":"'Order Form'!$E$11","v":0},{"$f":"IF(('Order Form'!$E$15=\"YES\"),'Order Form'!$E$12,\"\")","v":0},{"$f":"'Order Form'!$E$13 & \"\"","v":""},{"$f":"IF('Order Form'!D295=\"\",'Order Form'!C295,'Order Form'!D295) & \"\"","v":""},{"$f":"'Order Form'!E295 & \"\"","v":""},{"$f":"'Order Form'!F295","v":0},{"$f":"'Order Form'!I295","v":0},{"$f":"'Order Form'!G295","v":0},{"$f":"'Order Form'!H295","v":0},{"$f":"'Order Form'!J295 & \"\"","v":""},{"$f":"'Order Form'!L295 & \"\"","v":""},{"$f":"'Order Form'!C295 & \"\"","v":""},{"$f":"'Order Form'!K295 & \"\"","v":""},{"$f":"'Order Form'!$E$14","v":"YES"},{"$f":"'Order Form'!$E$19","v":0},{"$f":"'Order Form'!$E$16","v":"FREE gift card"},{"$f":"'Order Form'!$E$17","v":"No thanks"},"No","No",{"$f":"\"Dispatch Week: \"&'Order Form'!$E$18","v":"Dispatch Week: "},{"$f":"\"VIP: \"&'Order Form'!$E$5 &\"; Rib: \"&'Order Form'!$E$17 &\"; GT: \"&'Order Form'!$E$16","v":"VIP: ; Rib: No thanks; GT: FREE gift card"},null,null,null,{"$f":"IF(P275=\"\",\"\",IFERROR(INDIRECT(\"Postcodes!$C\"&SUMPRODUCT(--(Postcodes!$A$2:$A$100<=P275)*(Postcodes!$B$2:$B$100>=P275), ROW(Postcodes!$A$2:$A$100))),\"WRONG CODE\"))","v":0},null,null,null,null,null,null,""]
[{"$f":"'Order Form'!A296","v":275},{"$f":"'Order Form'!M296","v":""},{"$f":"'Order Form'!$E$4","v":0},{"$f":"'Order Form'!$E$5","v":0},{"$f":"'Order Form'!$E$6","v":0},{"$f":"'Order Form'!$E$7","v":0},{"$f":"'Order Form'!$E$9","v":0},{"$f":"'Order Form'!$E$8","v":0},{"$f":"'Order Form'!$E$10","v":0},{"$f":"'Order Form'!$E$11","v":0},{"$f":"IF(('Order Form'!$E$15=\"YES\"),'Order Form'!$E$12,\"\")","v":0},{"$f":"'Order Form'!$E$13 & \"\"","v":""},{"$f":"IF('Order Form'!D296=\"\",'Order Form'!C296,'Order Form'!D296) & \"\"","v":""},{"$f":"'Order Form'!E296 & \"\"","v":""},{"$f":"'Order Form'!F296","v":0},{"$f":"'Order Form'!I296","v":0},{"$f":"'Order Form'!G296","v":0},{"$f":"'Order Form'!H296","v":0},{"$f":"'Order Form'!J296 & \"\"","v":""},{"$f":"'Order Form'!L296 & \"\"","v":""},{"$f":"'Order Form'!C296 & \"\"","v":""},{"$f":"'Order Form'!K296 & \"\"","v":""},{"$f":"'Order Form'!$E$14","v":"YES"},{"$f":"'Order Form'!$E$19","v":0},{"$f":"'Order Form'!$E$16","v":"FREE gift card"},{"$f":"'Order Form'!$E$17","v":"No thanks"},"No","No",{"$f":"\"Dispatch Week: \"&'Order Form'!$E$18","v":"Dispatch Week: "},{"$f":"\"VIP: \"&'Order Form'!$E$5 &\"; Rib: \"&'Order Form'!$E$17 &\"; GT: \"&'Order Form'!$E$16","v":"VIP: ; Rib: No thanks; GT: FREE gift card"},null,null,null,{"$f":"IF(P276=\"\",\"\",IFERROR(INDIRECT(\"Postcodes!$C\"&SUMPRODUCT(--(Postcodes!$A$2:$A$100<=P276)*(Postcodes!$B$2:$B$100>=P276), ROW(Postcodes!$A$2:$A$100))),\"WRONG CODE\"))","v":0},null,null,null,null,null,null,""]
[{"$f":"'Order Form'!A297","v":276},{"$f":"'Order Form'!M297","v":""},{"$f":"'Order Form'!$E$4","v":0},{"$f":"'Order Form'!$E$5","v":0},{"$f":"'Order Form'!$E$6","v":0},{"$f":"'Order Form'!$E$7","v":0},{"$f":"'Order Form'!$E$9","v":0},{"$f":"'Order Form'!$E$8","v":0},{"$f":"'Order Form'!$E$10","v":0},{"$f":"'Order Form'!$E$11","v":0},{"$f":"IF(('Order Form'!$E$15=\"YES\"),'Order Form'!$E$12,\"\")","v":0},{"$f":"'Order Form'!$E$13 & \"\"","v":""},{"$f":"IF('Order Form'!D297=\"\",'Order Form'!C297,'Order Form'!D297) & \"\"","v":""},{"$f":"'Order Form'!E297 & \"\"","v":""},{"$f":"'Order Form'!F297","v":0},{"$f":"'Order Form'!I297","v":0},{"$f":"'Order Form'!G297","v":0},{"$f":"'Order Form'!H297","v":0},{"$f":"'Order Form'!J297 & \"\"","v":""},{"$f":"'Order Form'!L297 & \"\"","v":""},{"$f":"'Order Form'!C297 & \"\"","v":""},{"$f":"'Order Form'!K297 & \"\"","v":""},{"$f":"'Order Form'!$E$14","v":"YES"},{"$f":"'Order Form'!$E$19","v":0},{"$f":"'Order Form'!$E$16","v":"FREE gift card"},{"$f":"'Order Form'!$E$17","v":"No thanks"},"No","No",{"$f":"\"Dispatch Week: \"&'Order Form'!$E$18","v":"Dispatch Week: "},{"$f":"\"VIP: \"&'Order Form'!$E$5 &\"; Rib: \"&'Order Form'!$E$17 &\"; GT: \"&'Order Form'!$E$16","v":"VIP: ; Rib: No thanks; GT: FREE gift card"},null,null,null,{"$f":"IF(P277=\"\",\"\",IFERROR(INDIRECT(\"Postcodes!$C\"&SUMPRODUCT(--(Postcodes!$A$2:$A$100<=P277)*(Postcodes!$B$2:$B$100>=P277), ROW(Postcodes!$A$2:$A$100))),\"WRONG CODE\"))","v":0},null,null,null,null,null,null,""]
[{"$f":"'Order Form'!A298","v":277},{"$f":"'Order Form'!M298","v":""},{"$f":"'Order Form'!$E$4","v":0},{"$f":"'Order Form'!$E$5","v":0},{"$f":"'Order Form'!$E$6","v":0},{"$f":"'Order Form'!$E$7","v":0},{"$f":"'Order Form'!$E$9","v":0},{"$f":"'Order Form'!$E$8","v":0},{"$f":"'Order Form'!$E$10","v":0},{"$f":"'Order Form'!$E$11","v":0},{"$f":"IF(('Order Form'!$E$15=\"YES\"),'Order Form'!$E$12,\"\")","v":0},{"$f":"'Order Form'!$E$13 & \"\"","v":""},{"$f":"IF('Order Form'!D298=\"\",'Order Form'!C298,'Order Form'!D298) & \"\"","v":""},{"$f":"'Order Form'!E298 & \"\"","v":""},{"$f":"'Order Form'!F298","v":0},{"$f":"'Order Form'!I298","v":0},{"$f":"'Order Form'!G298","v":0},{"$f":"'Order Form'!H298","v":0},{"$f":"'Order Form'!J298 & \"\"","v":""},{"$f":"'Order Form'!L298 & \"\"","v":""},{"$f":"'Order Form'!C298 & \"\"","v":""},{"$f":"'Order Form'!K298 & \"\"","v":""},{"$f":"'Order Form'!$E$14","v":"YES"},{"$f":"'Order Form'!$E$19","v":0},{"$f":"'Order Form'!$E$16","v":"FREE gift card"},{"$f":"'Order Form'!$E$17","v":"No thanks"},"No","No",{"$f":"\"Dispatch Week: \"&'Order Form'!$E$18","v":"Dispatch Week: "},{"$f":"\"VIP: \"&'Order Form'!$E$5 &\"; Rib: \"&'Order Form'!$E$17 &\"; GT: \"&'Order Form'!$E$16","v":"VIP: ; Rib: No thanks; GT: FREE gift card"},null,null,null,{"$f":"IF(P278=\"\",\"\",IFERROR(INDIRECT(\"Postcodes!$C\"&SUMPRODUCT(--(Postcodes!$A$2:$A$100<=P278)*(Postcodes!$B$2:$B$100>=P278), ROW(Postcodes!$A$2:$A$100))),\"WRONG CODE\"))","v":0},null,null,null,null,null,null,""]
[{"$f":"'Order Form'!A299","v":278},{"$f":"'Order Form'!M299","v":""},{"$f":"'Order Form'!$E$4","v":0},{"$f":"'Order Form'!$E$5","v":0},{"$f":"'Order Form'!$E$6","v":0},{"$f":"'Order Form'!$E$7","v":0},{"$f":"'Order Form'!$E$9","v":0},{"$f":"'Order Form'!$E$8","v":0},{"$f":"'Order Form'!$E$10","v":0},{"$f":"'Order Form'!$E$11","v":0},{"$f":"IF(('Order Form'!$E$15=\"YES\"),'Order Form'!$E$12,\"\")","v":0},{"$f":"'Order Form'!$E$13 & \"\"","v":""},{"$f":"IF('Order Form'!D299=\"\",'Order Form'!C299,'Order Form'!D299) & \"\"","v":""},{"$f":"'Order Form'!E299 & \"\"","v":""},{"$f":"'Order Form'!F299","v":0},{"$f":"'Order Form'!I299","v":0},{"$f":"'Order Form'!G299","v":0},{"$f":"'Order Form'!H299","v":0},{"$f":"'Order Form'!J299 & \"\"","v":""},{"$f":"'Order Form'!L299 & \"\"","v":""},{"$f":"'Order Form'!C299 & \"\"","v":""},{"$f":"'Order Form'!K299 & \"\"","v":""},{"$f":"'Order Form'!$E$14","v":"YES"},{"$f":"'Order Form'!$E$19","v":0},{"$f":"'Order Form'!$E$16","v":"FREE gift card"},{"$f":"'Order Form'!$E$17","v":"No thanks"},"No","No",{"$f":"\"Dispatch Week: \"&'Order Form'!$E$18","v":"Dispatch Week: "},{"$f":"\"VIP: \"&'Order Form'!$E$5 &\"; Rib: \"&'Order Form'!$E$17 &\"; GT: \"&'Order Form'!$E$16","v":"VIP: ; Rib: No thanks; GT: FREE gift card"},null,null,null,{"$f":"IF(P279=\"\",\"\",IFERROR(INDIRECT(\"Postcodes!$C\"&SUMPRODUCT(--(Postcodes!$A$2:$A$100<=P279)*(Postcodes!$B$2:$B$100>=P279), ROW(Postcodes!$A$2:$A$100))),\"WRONG CODE\"))","v":0},null,null,null,null,null,null,""]
[{"$f":"'Order Form'!A300","v":279},{"$f":"'Order Form'!M300","v":""},{"$f":"'Order Form'!$E$4","v":0},{"$f":"'Order Form'!$E$5","v":0},{"$f":"'Order Form'!$E$6","v":0},{"$f":"'Order Form'!$E$7","v":0},{"$f":"'Order Form'!$E$9","v":0},{"$f":"'Order Form'!$E$8","v":0},{"$f":"'Order Form'!$E$10","v":0},{"$f":"'Order Form'!$E$11","v":0},{"$f":"IF(('Order Form'!$E$15=\"YES\"),'Order Form'!$E$12,\"\")","v":0},{"$f":"'Order Form'!$E$13 & \"\"","v":""},{"$f":"IF('Order Form'!D300=\"\",'Order Form'!C300,'Order Form'!D300) & \"\"","v":""},{"$f":"'Order Form'!E300 & \"\"","v":""},{"$f":"'Order Form'!F300","v":0},{"$f":"'Order Form'!I300","v":0},{"$f":"'Order Form'!G300","v":0},{"$f":"'Order Form'!H300","v":0},{"$f":"'Order Form'!J300 & \"\"","v":""},{"$f":"'Order Form'!L300 & \"\"","v":""},{"$f":"'Order Form'!C300 & \"\"","v":""},{"$f":"'Order Form'!K300 & \"\"","v":""},{"$f":"'Order Form'!$E$14","v":"YES"},{"$f":"'Order Form'!$E$19","v":0},{"$f":"'Order Form'!$E$16","v":"FREE gift card"},{"$f":"'Order Form'!$E$17","v":"No thanks"},"No","No",{"$f":"\"Dispatch Week: \"&'Order Form'!$E$18","v":"Dispatch Week: "},{"$f":"\"VIP: \"&'Order Form'!$E$5 &\"; Rib: \"&'Order Form'!$E$17 &\"; GT: \"&'Order Form'!$E$16","v":"VIP: ; Rib: No thanks; GT: FREE gift card"},null,null,null,{"$f":"IF(P280=\"\",\"\",IFERROR(INDIRECT(\"Postcodes!$C\"&SUMPRODUCT(--(Postcodes!$A$2:$A$100<=P280)*(Postcodes!$B$2:$B$100>=P280), ROW(Postcodes!$A$2:$A$100))),\"WRONG CODE\"))","v":0},null,null,null,null,null,null,""]
[{"$f":"'Order Form'!A301","v":280},{"$f":"'Order Form'!M301","v":""},{"$f":"'Order Form'!$E$4","v":0},{"$f":"'Order Form'!$E$5","v":0},{"$f":"'Order Form'!$E$6","v":0},{"$f":"'Order Form'!$E$7","v":0},{"$f":"'Order Form'!$E$9","v":0},{"$f":"'Order Form'!$E$8","v":0},{"$f":"'Order Form'!$E$10","v":0},{"$f":"'Order Form'!$E$11","v":0},{"$f":"IF(('Order Form'!$E$15=\"YES\"),'Order Form'!$E$12,\"\")","v":0},{"$f":"'Order Form'!$E$13 & \"\"","v":""},{"$f":"IF('Order Form'!D301=\"\",'Order Form'!C301,'Order Form'!D301) & \"\"","v":""},{"$f":"'Order Form'!E301 & \"\"","v":""},{"$f":"'Order Form'!F301","v":0},{"$f":"'Order Form'!I301","v":0},{"$f":"'Order Form'!G301","v":0},{"$f":"'Order Form'!H301","v":0},{"$f":"'Order Form'!J301 & \"\"","v":""},{"$f":"'Order Form'!L301 & \"\"","v":""},{"$f":"'Order Form'!C301 & \"\"","v":""},{"$f":"'Order Form'!K301 & \"\"","v":""},{"$f":"'Order Form'!$E$14","v":"YES"},{"$f":"'Order Form'!$E$19","v":0},{"$f":"'Order Form'!$E$16","v":"FREE gift card"},{"$f":"'Order Form'!$E$17","v":"No thanks"},"No","No",{"$f":"\"Dispatch Week: \"&'Order Form'!$E$18","v":"Dispatch Week: "},{"$f":"\"VIP: \"&'Order Form'!$E$5 &\"; Rib: \"&'Order Form'!$E$17 &\"; GT: \"&'Order Form'!$E$16","v":"VIP: ; Rib: No thanks; GT: FREE gift card"},null,null,null,{"$f":"IF(P281=\"\",\"\",IFERROR(INDIRECT(\"Postcodes!$C\"&SUMPRODUCT(--(Postcodes!$A$2:$A$100<=P281)*(Postcodes!$B$2:$B$100>=P281), ROW(Postcodes!$A$2:$A$100))),\"WRONG CODE\"))","v":0},null,null,null,null,null,null,""]
[{"$f":"'Order Form'!A302","v":281},{"$f":"'Order Form'!M302","v":""},{"$f":"'Order Form'!$E$4","v":0},{"$f":"'Order Form'!$E$5","v":0},{"$f":"'Order Form'!$E$6","v":0},{"$f":"'Order Form'!$E$7","v":0},{"$f":"'Order Form'!$E$9","v":0},{"$f":"'Order Form'!$E$8","v":0},{"$f":"'Order Form'!$E$10","v":0},{"$f":"'Order Form'!$E$11","v":0},{"$f":"IF(('Order Form'!$E$15=\"YES\"),'Order Form'!$E$12,\"\")","v":0},{"$f":"'Order Form'!$E$13 & \"\"","v":""},{"$f":"IF('Order Form'!D302=\"\",'Order Form'!C302,'Order Form'!D302) & \"\"","v":""},{"$f":"'Order Form'!E302 & \"\"","v":""},{"$f":"'Order Form'!F302","v":0},{"$f":"'Order Form'!I302","v":0},{"$f":"'Order Form'!G302","v":0},{"$f":"'Order Form'!H302","v":0},{"$f":"'Order Form'!J302 & \"\"","v":""},{"$f":"'Order Form'!L302 & \"\"","v":""},{"$f":"'Order Form'!C302 & \"\"","v":""},{"$f":"'Order Form'!K302 & \"\"","v":""},{"$f":"'Order Form'!$E$14","v":"YES"},{"$f":"'Order Form'!$E$19","v":0},{"$f":"'Order Form'!$E$16","v":"FREE gift card"},{"$f":"'Order Form'!$E$17","v":"No thanks"},"No","No",{"$f":"\"Dispatch Week: \"&'Order Form'!$E$18","v":"Dispatch Week: "},{"$f":"\"VIP: \"&'Order Form'!$E$5 &\"; Rib: \"&'Order Form'!$E$17 &\"; GT: \"&'Order Form'!$E$16","v":"VIP: ; Rib: No thanks; GT: FREE gift card"},null,null,null,{"$f":"IF(P282=\"\",\"\",IFERROR(INDIRECT(\"Postcodes!$C\"&SUMPRODUCT(--(Postcodes!$A$2:$A$100<=P282)*(Postcodes!$B$2:$B$100>=P282), ROW(Postcodes!$A$2:$A$100))),\"WRONG CODE\"))","v":0},null,null,null,null,null,null,""]
[{"$f":"'Order Form'!A303","v":282},{"$f":"'Order Form'!M303","v":""},{"$f":"'Order Form'!$E$4","v":0},{"$f":"'Order Form'!$E$5","v":0},{"$f":"'Order Form'!$E$6","v":0},{"$f":"'Order Form'!$E$7","v":0},{"$f":"'Order Form'!$E$9","v":0},{"$f":"'Order Form'!$E$8","v":0},{"$f":"'Order Form'!$E$10","v":0},{"$f":"'Order Form'!$E$11","v":0},{"$f":"IF(('Order Form'!$E$15=\"YES\"),'Order Form'!$E$12,\"\")","v":0},{"$f":"'Order Form'!$E$13 & \"\"","v":""},{"$f":"IF('Order Form'!D303=\"\",'Order Form'!C303,'Order Form'!D303) & \"\"","v":""},{"$f":"'Order Form'!E303 & \"\"","v":""},{"$f":"'Order Form'!F303","v":0},{"$f":"'Order Form'!I303","v":0},{"$f":"'Order Form'!G303","v":0},{"$f":"'Order Form'!H303","v":0},{"$f":"'Order Form'!J303 & \"\"","v":""},{"$f":"'Order Form'!L303 & \"\"","v":""},{"$f":"'Order Form'!C303 & \"\"","v":""},{"$f":"'Order Form'!K303 & \"\"","v":""},{"$f":"'Order Form'!$E$14","v":"YES"},{"$f":"'Order Form'!$E$19","v":0},{"$f":"'Order Form'!$E$16","v":"FREE gift card"},{"$f":"'Order Form'!$E$17","v":"No thanks"},"No","No",{"$f":"\"Dispatch Week: \"&'Order Form'!$E$18","v":"Dispatch Week: "},{"$f":"\"VIP: \"&'Order Form'!$E$5 &\"; Rib: \"&'Order Form'!$E$17 &\"; GT: \"&'Order Form'!$E$16","v":"VIP: ; Rib: No thanks; GT: FREE gift card"},null,null,null,{"$f":"IF(P283=\"\",\"\",IFERROR(INDIRECT(\"Postcodes!$C\"&SUMPRODUCT(--(Postcodes!$A$2:$A$100<=P283)*(Postcodes!$B$2:$B$100>=P283), ROW(Postcodes!$A$2:$A$100))),\"WRONG CODE\"))","v":0},null,null,null,null,null,null,""]
[{"$f":"'Order Form'!A304","v":283},{"$f":"'Order Form'!M304","v":""},{"$f":"'Order Form'!$E$4","v":0},{"$f":"'Order Form'!$E$5","v":0},{"$f":"'Order Form'!$E$6","v":0},{"$f":"'Order Form'!$E$7","v":0},{"$f":"'Order Form'!$E$9","v":0},{"$f":"'Order Form'!$E$8","v":0},{"$f":"'Order Form'!$E$10","v":0},{"$f":"'Order Form'!$E$11","v":0},{"$f":"IF(('Order Form'!$E$15=\"YES\"),'Order Form'!$E$12,\"\")","v":0},{"$f":"'Order Form'!$E$13 & \"\"","v":""},{"$f":"IF('Order Form'!D304=\"\",'Order Form'!C304,'Order Form'!D304) & \"\"","v":""},{"$f":"'Order Form'!E304 & \"\"","v":""},{"$f":"'Order Form'!F304","v":0},{"$f":"'Order Form'!I304","v":0},{"$f":"'Order Form'!G304","v":0},{"$f":"'Order Form'!H304","v":0},{"$f":"'Order Form'!J304 & \"\"","v":""},{"$f":"'Order Form'!L304 & \"\"","v":""},{"$f":"'Order Form'!C304 & \"\"","v":""},{"$f":"'Order Form'!K304 & \"\"","v":""},{"$f":"'Order Form'!$E$14","v":"YES"},{"$f":"'Order Form'!$E$19","v":0},{"$f":"'Order Form'!$E$16","v":"FREE gift card"},{"$f":"'Order Form'!$E$17","v":"No thanks"},"No","No",{"$f":"\"Dispatch Week: \"&'Order Form'!$E$18","v":"Dispatch Week: "},{"$f":"\"VIP: \"&'Order Form'!$E$5 &\"; Rib: \"&'Order Form'!$E$17 &\"; GT: \"&'Order Form'!$E$16","v":"VIP: ; Rib: No thanks; GT: FREE gift card"},null,null,null,{"$f":"IF(P284=\"\",\"\",IFERROR(INDIRECT(\"Postcodes!$C\"&SUMPRODUCT(--(Postcodes!$A$2:$A$100<=P284)*(Postcodes!$B$2:$B$100>=P284), ROW(Postcodes!$A$2:$A$100))),\"WRONG CODE\"))","v":0},null,null,null,null,null,null,""]
[{"$f":"'Order Form'!A305","v":284},{"$f":"'Order Form'!M305","v":""},{"$f":"'Order Form'!$E$4","v":0},{"$f":"'Order Form'!$E$5","v":0},{"$f":"'Order Form'!$E$6","v":0},{"$f":"'Order Form'!$E$7","v":0},{"$f":"'Order Form'!$E$9","v":0},{"$f":"'Order Form'!$E$8","v":0},{"$f":"'Order Form'!$E$10","v":0},{"$f":"'Order Form'!$E$11","v":0},{"$f":"IF(('Order Form'!$E$15=\"YES\"),'Order Form'!$E$12,\"\")","v":0},{"$f":"'Order Form'!$E$13 & \"\"","v":""},{"$f":"IF('Order Form'!D305=\"\",'Order Form'!C305,'Order Form'!D305) & \"\"","v":""},{"$f":"'Order Form'!E305 & \"\"","v":""},{"$f":"'Order Form'!F305","v":0},{"$f":"'Order Form'!I305","v":0},{"$f":"'Order Form'!G305","v":0},{"$f":"'Order Form'!H305","v":0},{"$f":"'Order Form'!J305 & \"\"","v":""},{"$f":"'Order Form'!L305 & \"\"","v":""},{"$f":"'Order Form'!C305 & \"\"","v":""},{"$f":"'Order Form'!K305 & \"\"","v":""},{"$f":"'Order Form'!$E$14","v":"YES"},{"$f":"'Order Form'!$E$19","v":0},{"$f":"'Order Form'!$E$16","v":"FREE gift card"},{"$f":"'Order Form'!$E$17","v":"No thanks"},"No","No",{"$f":"\"Dispatch Week: \"&'Order Form'!$E$18","v":"Dispatch Week: "},{"$f":"\"VIP: \"&'Order Form'!$E$5 &\"; Rib: \"&'Order Form'!$E$17 &\"; GT: \"&'Order Form'!$E$16","v":"VIP: ; Rib: No thanks; GT: FREE gift card"},null,null,null,{"$f":"IF(P285=\"\",\"\",IFERROR(INDIRECT(\"Postcodes!$C\"&SUMPRODUCT(--(Postcodes!$A$2:$A$100<=P285)*(Postcodes!$B$2:$B$100>=P285), ROW(Postcodes!$A$2:$A$100))),\"WRONG CODE\"))","v":0},null,null,null,null,null,null,""]
[{"$f":"'Order Form'!A306","v":285},{"$f":"'Order Form'!M306","v":""},{"$f":"'Order Form'!$E$4","v":0},{"$f":"'Order Form'!$E$5","v":0},{"$f":"'Order Form'!$E$6","v":0},{"$f":"'Order Form'!$E$7","v":0},{"$f":"'Order Form'!$E$9","v":0},{"$f":"'Order Form'!$E$8","v":0},{"$f":"'Order Form'!$E$10","v":0},{"$f":"'Order Form'!$E$11","v":0},{"$f":"IF(('Order Form'!$E$15=\"YES\"),'Order Form'!$E$12,\"\")","v":0},{"$f":"'Order Form'!$E$13 & \"\"","v":""},{"$f":"IF('Order Form'!D306=\"\",'Order Form'!C306,'Order Form'!D306) & \"\"","v":""},{"$f":"'Order Form'!E306 & \"\"","v":""},{"$f":"'Order Form'!F306","v":0},{"$f":"'Order Form'!I306","v":0},{"$f":"'Order Form'!G306","v":0},{"$f":"'Order Form'!H306","v":0},{"$f":"'Order Form'!J306 & \"\"","v":""},{"$f":"'Order Form'!L306 & \"\"","v":""},{"$f":"'Order Form'!C306 & \"\"","v":""},{"$f":"'Order Form'!K306 & \"\"","v":""},{"$f":"'Order Form'!$E$14","v":"YES"},{"$f":"'Order Form'!$E$19","v":0},{"$f":"'Order Form'!$E$16","v":"FREE gift card"},{"$f":"'Order Form'!$E$17","v":"No thanks"},"No","No",{"$f":"\"Dispatch Week: \"&'Order Form'!$E$18","v":"Dispatch Week: "},{"$f":"\"VIP: \"&'Order Form'!$E$5 &\"; Rib: \"&'Order Form'!$E$17 &\"; GT: \"&'Order Form'!$E$16","v":"VIP: ; Rib: No thanks; GT: FREE gift card"},null,null,null,{"$f":"IF(P286=\"\",\"\",IFERROR(INDIRECT(\"Postcodes!$C\"&SUMPRODUCT(--(Postcodes!$A$2:$A$100<=P286)*(Postcodes!$B$2:$B$100>=P286), ROW(Postcodes!$A$2:$A$100))),\"WRONG CODE\"))","v":0},null,null,null,null,null,null,""]
[{"$f":"'Order Form'!A307","v":286},{"$f":"'Order Form'!M307","v":""},{"$f":"'Order Form'!$E$4","v":0},{"$f":"'Order Form'!$E$5","v":0},{"$f":"'Order Form'!$E$6","v":0},{"$f":"'Order Form'!$E$7","v":0},{"$f":"'Order Form'!$E$9","v":0},{"$f":"'Order Form'!$E$8","v":0},{"$f":"'Order Form'!$E$10","v":0},{"$f":"'Order Form'!$E$11","v":0},{"$f":"IF(('Order Form'!$E$15=\"YES\"),'Order Form'!$E$12,\"\")","v":0},{"$f":"'Order Form'!$E$13 & \"\"","v":""},{"$f":"IF('Order Form'!D307=\"\",'Order Form'!C307,'Order Form'!D307) & \"\"","v":""},{"$f":"'Order Form'!E307 & \"\"","v":""},{"$f":"'Order Form'!F307","v":0},{"$f":"'Order Form'!I307","v":0},{"$f":"'Order Form'!G307","v":0},{"$f":"'Order Form'!H307","v":0},{"$f":"'Order Form'!J307 & \"\"","v":""},{"$f":"'Order Form'!L307 & \"\"","v":""},{"$f":"'Order Form'!C307 & \"\"","v":""},{"$f":"'Order Form'!K307 & \"\"","v":""},{"$f":"'Order Form'!$E$14","v":"YES"},{"$f":"'Order Form'!$E$19","v":0},{"$f":"'Order Form'!$E$16","v":"FREE gift card"},{"$f":"'Order Form'!$E$17","v":"No thanks"},"No","No",{"$f":"\"Dispatch Week: \"&'Order Form'!$E$18","v":"Dispatch Week: "},{"$f":"\"VIP: \"&'Order Form'!$E$5 &\"; Rib: \"&'Order Form'!$E$17 &\"; GT: \"&'Order Form'!$E$16","v":"VIP: ; Rib: No thanks; GT: FREE gift card"},null,null,null,{"$f":"IF(P287=\"\",\"\",IFERROR(INDIRECT(\"Postcodes!$C\"&SUMPRODUCT(--(Postcodes!$A$2:$A$100<=P287)*(Postcodes!$B$2:$B$100>=P287), ROW(Postcodes!$A$2:$A$100))),\"WRONG CODE\"))","v":0},null,null,null,null,null,null,""]
[{"$f":"'Order Form'!A308","v":287},{"$f":"'Order Form'!M308","v":""},{"$f":"'Order Form'!$E$4","v":0},{"$f":"'Order Form'!$E$5","v":0},{"$f":"'Order Form'!$E$6","v":0},{"$f":"'Order Form'!$E$7","v":0},{"$f":"'Order Form'!$E$9","v":0},{"$f":"'Order Form'!$E$8","v":0},{"$f":"'Order Form'!$E$10","v":0},{"$f":"'Order Form'!$E$11","v":0},{"$f":"IF(('Order Form'!$E$15=\"YES\"),'Order Form'!$E$12,\"\")","v":0},{"$f":"'Order Form'!$E$13 & \"\"","v":""},{"$f":"IF('Order Form'!D308=\"\",'Order Form'!C308,'Order Form'!D308) & \"\"","v":""},{"$f":"'Order Form'!E308 & \"\"","v":""},{"$f":"'Order Form'!F308","v":0},{"$f":"'Order Form'!I308","v":0},{"$f":"'Order Form'!G308","v":0},{"$f":"'Order Form'!H308","v":0},{"$f":"'Order Form'!J308 & \"\"","v":""},{"$f":"'Order Form'!L308 & \"\"","v":""},{"$f":"'Order Form'!C308 & \"\"","v":""},{"$f":"'Order Form'!K308 & \"\"","v":""},{"$f":"'Order Form'!$E$14","v":"YES"},{"$f":"'Order Form'!$E$19","v":0},{"$f":"'Order Form'!$E$16","v":"FREE gift card"},{"$f":"'Order Form'!$E$17","v":"No thanks"},"No","No",{"$f":"\"Dispatch Week: \"&'Order Form'!$E$18","v":"Dispatch Week: "},{"$f":"\"VIP: \"&'Order Form'!$E$5 &\"; Rib: \"&'Order Form'!$E$17 &\"; GT: \"&'Order Form'!$E$16","v":"VIP: ; Rib: No thanks; GT: FREE gift card"},null,null,null,{"$f":"IF(P288=\"\",\"\",IFERROR(INDIRECT(\"Postcodes!$C\"&SUMPRODUCT(--(Postcodes!$A$2:$A$100<=P288)*(Postcodes!$B$2:$B$100>=P288), ROW(Postcodes!$A$2:$A$100))),\"WRONG CODE\"))","v":0},null,null,null,null,null,null,""]
[{"$f":"'Order Form'!A309","v":288},{"$f":"'Order Form'!M309","v":""},{"$f":"'Order Form'!$E$4","v":0},{"$f":"'Order Form'!$E$5","v":0},{"$f":"'Order Form'!$E$6","v":0},{"$f":"'Order Form'!$E$7","v":0},{"$f":"'Order Form'!$E$9","v":0},{"$f":"'Order Form'!$E$8","v":0},{"$f":"'Order Form'!$E$10","v":0},{"$f":"'Order Form'!$E$11","v":0},{"$f":"IF(('Order Form'!$E$15=\"YES\"),'Order Form'!$E$12,\"\")","v":0},{"$f":"'Order Form'!$E$13 & \"\"","v":""},{"$f":"IF('Order Form'!D309=\"\",'Order Form'!C309,'Order Form'!D309) & \"\"","v":""},{"$f":"'Order Form'!E309 & \"\"","v":""},{"$f":"'Order Form'!F309","v":0},{"$f":"'Order Form'!I309","v":0},{"$f":"'Order Form'!G309","v":0},{"$f":"'Order Form'!H309","v":0},{"$f":"'Order Form'!J309 & \"\"","v":""},{"$f":"'Order Form'!L309 & \"\"","v":""},{"$f":"'Order Form'!C309 & \"\"","v":""},{"$f":"'Order Form'!K309 & \"\"","v":""},{"$f":"'Order Form'!$E$14","v":"YES"},{"$f":"'Order Form'!$E$19","v":0},{"$f":"'Order Form'!$E$16","v":"FREE gift card"},{"$f":"'Order Form'!$E$17","v":"No thanks"},"No","No",{"$f":"\"Dispatch Week: \"&'Order Form'!$E$18","v":"Dispatch Week: "},{"$f":"\"VIP: \"&'Order Form'!$E$5 &\"; Rib: \"&'Order Form'!$E$17 &\"; GT: \"&'Order Form'!$E$16","v":"VIP: ; Rib: No thanks; GT: FREE gift card"},null,null,null,{"$f":"IF(P289=\"\",\"\",IFERROR(INDIRECT(\"Postcodes!$C\"&SUMPRODUCT(--(Postcodes!$A$2:$A$100<=P289)*(Postcodes!$B$2:$B$100>=P289), ROW(Postcodes!$A$2:$A$100))),\"WRONG CODE\"))","v":0},null,null,null,null,null,null,""]
[{"$f":"'Order Form'!A310","v":289},{"$f":"'Order Form'!M310","v":""},{"$f":"'Order Form'!$E$4","v":0},{"$f":"'Order Form'!$E$5","v":0},{"$f":"'Order Form'!$E$6","v":0},{"$f":"'Order Form'!$E$7","v":0},{"$f":"'Order Form'!$E$9","v":0},{"$f":"'Order Form'!$E$8","v":0},{"$f":"'Order Form'!$E$10","v":0},{"$f":"'Order Form'!$E$11","v":0},{"$f":"IF(('Order Form'!$E$15=\"YES\"),'Order Form'!$E$12,\"\")","v":0},{"$f":"'Order Form'!$E$13 & \"\"","v":""},{"$f":"IF('Order Form'!D310=\"\",'Order Form'!C310,'Order Form'!D310) & \"\"","v":""},{"$f":"'Order Form'!E310 & \"\"","v":""},{"$f":"'Order Form'!F310","v":0},{"$f":"'Order Form'!I310","v":0},{"$f":"'Order Form'!G310","v":0},{"$f":"'Order Form'!H310","v":0},{"$f":"'Order Form'!J310 & \"\"","v":""},{"$f":"'Order Form'!L310 & \"\"","v":""},{"$f":"'Order Form'!C310 & \"\"","v":""},{"$f":"'Order Form'!K310 & \"\"","v":""},{"$f":"'Order Form'!$E$14","v":"YES"},{"$f":"'Order Form'!$E$19","v":0},{"$f":"'Order Form'!$E$16","v":"FREE gift card"},{"$f":"'Order Form'!$E$17","v":"No thanks"},"No","No",{"$f":"\"Dispatch Week: \"&'Order Form'!$E$18","v":"Dispatch Week: "},{"$f":"\"VIP: \"&'Order Form'!$E$5 &\"; Rib: \"&'Order Form'!$E$17 &\"; GT: \"&'Order Form'!$E$16","v":"VIP: ; Rib: No thanks; GT: FREE gift card"},null,null,null,{"$f":"IF(P290=\"\",\"\",IFERROR(INDIRECT(\"Postcodes!$C\"&SUMPRODUCT(--(Postcodes!$A$2:$A$100<=P290)*(Postcodes!$B$2:$B$100>=P290), ROW(Postcodes!$A$2:$A$100))),\"WRONG CODE\"))","v":0},null,null,null,null,null,null,""]
[{"$f":"'Order Form'!A311","v":290},{"$f":"'Order Form'!M311","v":""},{"$f":"'Order Form'!$E$4","v":0},{"$f":"'Order Form'!$E$5","v":0},{"$f":"'Order Form'!$E$6","v":0},{"$f":"'Order Form'!$E$7","v":0},{"$f":"'Order Form'!$E$9","v":0},{"$f":"'Order Form'!$E$8","v":0},{"$f":"'Order Form'!$E$10","v":0},{"$f":"'Order Form'!$E$11","v":0},{"$f":"IF(('Order Form'!$E$15=\"YES\"),'Order Form'!$E$12,\"\")","v":0},{"$f":"'Order Form'!$E$13 & \"\"","v":""},{"$f":"IF('Order Form'!D311=\"\",'Order Form'!C311,'Order Form'!D311) & \"\"","v":""},{"$f":"'Order Form'!E311 & \"\"","v":""},{"$f":"'Order Form'!F311","v":0},{"$f":"'Order Form'!I311","v":0},{"$f":"'Order Form'!G311","v":0},{"$f":"'Order Form'!H311","v":0},{"$f":"'Order Form'!J311 & \"\"","v":""},{"$f":"'Order Form'!L311 & \"\"","v":""},{"$f":"'Order Form'!C311 & \"\"","v":""},{"$f":"'Order Form'!K311 & \"\"","v":""},{"$f":"'Order Form'!$E$14","v":"YES"},{"$f":"'Order Form'!$E$19","v":0},{"$f":"'Order Form'!$E$16","v":"FREE gift card"},{"$f":"'Order Form'!$E$17","v":"No thanks"},"No","No",{"$f":"\"Dispatch Week: \"&'Order Form'!$E$18","v":"Dispatch Week: "},{"$f":"\"VIP: \"&'Order Form'!$E$5 &\"; Rib: \"&'Order Form'!$E$17 &\"; GT: \"&'Order Form'!$E$16","v":"VIP: ; Rib: No thanks; GT: FREE gift card"},null,null,null,{"$f":"IF(P291=\"\",\"\",IFERROR(INDIRECT(\"Postcodes!$C\"&SUMPRODUCT(--(Postcodes!$A$2:$A$100<=P291)*(Postcodes!$B$2:$B$100>=P291), ROW(Postcodes!$A$2:$A$100))),\"WRONG CODE\"))","v":0},null,null,null,null,null,null,""]
[{"$f":"'Order Form'!A312","v":291},{"$f":"'Order Form'!M312","v":""},{"$f":"'Order Form'!$E$4","v":0},{"$f":"'Order Form'!$E$5","v":0},{"$f":"'Order Form'!$E$6","v":0},{"$f":"'Order Form'!$E$7","v":0},{"$f":"'Order Form'!$E$9","v":0},{"$f":"'Order Form'!$E$8","v":0},{"$f":"'Order Form'!$E$10","v":0},{"$f":"'Order Form'!$E$11","v":0},{"$f":"IF(('Order Form'!$E$15=\"YES\"),'Order Form'!$E$12,\"\")","v":0},{"$f":"'Order Form'!$E$13 & \"\"","v":""},{"$f":"IF('Order Form'!D312=\"\",'Order Form'!C312,'Order Form'!D312) & \"\"","v":""},{"$f":"'Order Form'!E312 & \"\"","v":""},{"$f":"'Order Form'!F312","v":0},{"$f":"'Order Form'!I312","v":0},{"$f":"'Order Form'!G312","v":0},{"$f":"'Order Form'!H312","v":0},{"$f":"'Order Form'!J312 & \"\"","v":""},{"$f":"'Order Form'!L312 & \"\"","v":""},{"$f":"'Order Form'!C312 & \"\"","v":""},{"$f":"'Order Form'!K312 & \"\"","v":""},{"$f":"'Order Form'!$E$14","v":"YES"},{"$f":"'Order Form'!$E$19","v":0},{"$f":"'Order Form'!$E$16","v":"FREE gift card"},{"$f":"'Order Form'!$E$17","v":"No thanks"},"No","No",{"$f":"\"Dispatch Week: \"&'Order Form'!$E$18","v":"Dispatch Week: "},{"$f":"\"VIP: \"&'Order Form'!$E$5 &\"; Rib: \"&'Order Form'!$E$17 &\"; GT: \"&'Order Form'!$E$16","v":"VIP: ; Rib: No thanks; GT: FREE gift card"},null,null,null,{"$f":"IF(P292=\"\",\"\",IFERROR(INDIRECT(\"Postcodes!$C\"&SUMPRODUCT(--(Postcodes!$A$2:$A$100<=P292)*(Postcodes!$B$2:$B$100>=P292), ROW(Postcodes!$A$2:$A$100))),\"WRONG CODE\"))","v":0},null,null,null,null,null,null,""]
[{"$f":"'Order Form'!A313","v":292},{"$f":"'Order Form'!M313","v":""},{"$f":"'Order Form'!$E$4","v":0},{"$f":"'Order Form'!$E$5","v":0},{"$f":"'Order Form'!$E$6","v":0},{"$f":"'Order Form'!$E$7","v":0},{"$f":"'Order Form'!$E$9","v":0},{"$f":"'Order Form'!$E$8","v":0},{"$f":"'Order Form'!$E$10","v":0},{"$f":"'Order Form'!$E$11","v":0},{"$f":"IF(('Order Form'!$E$15=\"YES\"),'Order Form'!$E$12,\"\")","v":0},{"$f":"'Order Form'!$E$13 & \"\"","v":""},{"$f":"IF('Order Form'!D313=\"\",'Order Form'!C313,'Order Form'!D313) & \"\"","v":""},{"$f":"'Order Form'!E313 & \"\"","v":""},{"$f":"'Order Form'!F313","v":0},{"$f":"'Order Form'!I313","v":0},{"$f":"'Order Form'!G313","v":0},{"$f":"'Order Form'!H313","v":0},{"$f":"'Order Form'!J313 & \"\"","v":""},{"$f":"'Order Form'!L313 & \"\"","v":""},{"$f":"'Order Form'!C313 & \"\"","v":""},{"$f":"'Order Form'!K313 & \"\"","v":""},{"$f":"'Order Form'!$E$14","v":"YES"},{"$f":"'Order Form'!$E$19","v":0},{"$f":"'Order Form'!$E$16","v":"FREE gift card"},{"$f":"'Order Form'!$E$17","v":"No thanks"},"No","No",{"$f":"\"Dispatch Week: \"&'Order Form'!$E$18","v":"Dispatch Week: "},{"$f":"\"VIP: \"&'Order Form'!$E$5 &\"; Rib: \"&'Order Form'!$E$17 &\"; GT: \"&'Order Form'!$E$16","v":"VIP: ; Rib: No thanks; GT: FREE gift card"},null,null,null,{"$f":"IF(P293=\"\",\"\",IFERROR(INDIRECT(\"Postcodes!$C\"&SUMPRODUCT(--(Postcodes!$A$2:$A$100<=P293)*(Postcodes!$B$2:$B$100>=P293), ROW(Postcodes!$A$2:$A$100))),\"WRONG CODE\"))","v":0},null,null,null,null,null,null,""]
[{"$f":"'Order Form'!A314","v":293},{"$f":"'Order Form'!M314","v":""},{"$f":"'Order Form'!$E$4","v":0},{"$f":"'Order Form'!$E$5","v":0},{"$f":"'Order Form'!$E$6","v":0},{"$f":"'Order Form'!$E$7","v":0},{"$f":"'Order Form'!$E$9","v":0},{"$f":"'Order Form'!$E$8","v":0},{"$f":"'Order Form'!$E$10","v":0},{"$f":"'Order Form'!$E$11","v":0},{"$f":"IF(('Order Form'!$E$15=\"YES\"),'Order Form'!$E$12,\"\")","v":0},{"$f":"'Order Form'!$E$13 & \"\"","v":""},{"$f":"IF('Order Form'!D314=\"\",'Order Form'!C314,'Order Form'!D314) & \"\"","v":""},{"$f":"'Order Form'!E314 & \"\"","v":""},{"$f":"'Order Form'!F314","v":0},{"$f":"'Order Form'!I314","v":0},{"$f":"'Order Form'!G314","v":0},{"$f":"'Order Form'!H314","v":0},{"$f":"'Order Form'!J314 & \"\"","v":""},{"$f":"'Order Form'!L314 & \"\"","v":""},{"$f":"'Order Form'!C314 & \"\"","v":""},{"$f":"'Order Form'!K314 & \"\"","v":""},{"$f":"'Order Form'!$E$14","v":"YES"},{"$f":"'Order Form'!$E$19","v":0},{"$f":"'Order Form'!$E$16","v":"FREE gift card"},{"$f":"'Order Form'!$E$17","v":"No thanks"},"No","No",{"$f":"\"Dispatch Week: \"&'Order Form'!$E$18","v":"Dispatch Week: "},{"$f":"\"VIP: \"&'Order Form'!$E$5 &\"; Rib: \"&'Order Form'!$E$17 &\"; GT: \"&'Order Form'!$E$16","v":"VIP: ; Rib: No thanks; GT: FREE gift card"},null,null,null,{"$f":"IF(P294=\"\",\"\",IFERROR(INDIRECT(\"Postcodes!$C\"&SUMPRODUCT(--(Postcodes!$A$2:$A$100<=P294)*(Postcodes!$B$2:$B$100>=P294), ROW(Postcodes!$A$2:$A$100))),\"WRONG CODE\"))","v":0},null,null,null,null,null,null,""]
[{"$f":"'Order Form'!A315","v":294},{"$f":"'Order Form'!M315","v":""},{"$f":"'Order Form'!$E$4","v":0},{"$f":"'Order Form'!$E$5","v":0},{"$f":"'Order Form'!$E$6","v":0},{"$f":"'Order Form'!$E$7","v":0},{"$f":"'Order Form'!$E$9","v":0},{"$f":"'Order Form'!$E$8","v":0},{"$f":"'Order Form'!$E$10","v":0},{"$f":"'Order Form'!$E$11","v":0},{"$f":"IF(('Order Form'!$E$15=\"YES\"),'Order Form'!$E$12,\"\")","v":0},{"$f":"'Order Form'!$E$13 & \"\"","v":""},{"$f":"IF('Order Form'!D315=\"\",'Order Form'!C315,'Order Form'!D315) & \"\"","v":""},{"$f":"'Order Form'!E315 & \"\"","v":""},{"$f":"'Order Form'!F315","v":0},{"$f":"'Order Form'!I315","v":0},{"$f":"'Order Form'!G315","v":0},{"$f":"'Order Form'!H315","v":0},{"$f":"'Order Form'!J315 & \"\"","v":""},{"$f":"'Order Form'!L315 & \"\"","v":""},{"$f":"'Order Form'!C315 & \"\"","v":""},{"$f":"'Order Form'!K315 & \"\"","v":""},{"$f":"'Order Form'!$E$14","v":"YES"},{"$f":"'Order Form'!$E$19","v":0},{"$f":"'Order Form'!$E$16","v":"FREE gift card"},{"$f":"'Order Form'!$E$17","v":"No thanks"},"No","No",{"$f":"\"Dispatch Week: \"&'Order Form'!$E$18","v":"Dispatch Week: "},{"$f":"\"VIP: \"&'Order Form'!$E$5 &\"; Rib: \"&'Order Form'!$E$17 &\"; GT: \"&'Order Form'!$E$16","v":"VIP: ; Rib: No thanks; GT: FREE gift card"},null,null,null,{"$f":"IF(P295=\"\",\"\",IFERROR(INDIRECT(\"Postcodes!$C\"&SUMPRODUCT(--(Postcodes!$A$2:$A$100<=P295)*(Postcodes!$B$2:$B$100>=P295), ROW(Postcodes!$A$2:$A$100))),\"WRONG CODE\"))","v":0},null,null,null,null,null,null,""]
[{"$f":"'Order Form'!A316","v":295},{"$f":"'Order Form'!M316","v":""},{"$f":"'Order Form'!$E$4","v":0},{"$f":"'Order Form'!$E$5","v":0},{"$f":"'Order Form'!$E$6","v":0},{"$f":"'Order Form'!$E$7","v":0},{"$f":"'Order Form'!$E$9","v":0},{"$f":"'Order Form'!$E$8","v":0},{"$f":"'Order Form'!$E$10","v":0},{"$f":"'Order Form'!$E$11","v":0},{"$f":"IF(('Order Form'!$E$15=\"YES\"),'Order Form'!$E$12,\"\")","v":0},{"$f":"'Order Form'!$E$13 & \"\"","v":""},{"$f":"IF('Order Form'!D316=\"\",'Order Form'!C316,'Order Form'!D316) & \"\"","v":""},{"$f":"'Order Form'!E316 & \"\"","v":""},{"$f":"'Order Form'!F316","v":0},{"$f":"'Order Form'!I316","v":0},{"$f":"'Order Form'!G316","v":0},{"$f":"'Order Form'!H316","v":0},{"$f":"'Order Form'!J316 & \"\"","v":""},{"$f":"'Order Form'!L316 & \"\"","v":""},{"$f":"'Order Form'!C316 & \"\"","v":""},{"$f":"'Order Form'!K316 & \"\"","v":""},{"$f":"'Order Form'!$E$14","v":"YES"},{"$f":"'Order Form'!$E$19","v":0},{"$f":"'Order Form'!$E$16","v":"FREE gift card"},{"$f":"'Order Form'!$E$17","v":"No thanks"},"No","No",{"$f":"\"Dispatch Week: \"&'Order Form'!$E$18","v":"Dispatch Week: "},{"$f":"\"VIP: \"&'Order Form'!$E$5 &\"; Rib: \"&'Order Form'!$E$17 &\"; GT: \"&'Order Form'!$E$16","v":"VIP: ; Rib: No thanks; GT: FREE gift card"},null,null,null,{"$f":"IF(P296=\"\",\"\",IFERROR(INDIRECT(\"Postcodes!$C\"&SUMPRODUCT(--(Postcodes!$A$2:$A$100<=P296)*(Postcodes!$B$2:$B$100>=P296), ROW(Postcodes!$A$2:$A$100))),\"WRONG CODE\"))","v":0},null,null,null,null,null,null,""]
[{"$f":"'Order Form'!A317","v":296},{"$f":"'Order Form'!M317","v":""},{"$f":"'Order Form'!$E$4","v":0},{"$f":"'Order Form'!$E$5","v":0},{"$f":"'Order Form'!$E$6","v":0},{"$f":"'Order Form'!$E$7","v":0},{"$f":"'Order Form'!$E$9","v":0},{"$f":"'Order Form'!$E$8","v":0},{"$f":"'Order Form'!$E$10","v":0},{"$f":"'Order Form'!$E$11","v":0},{"$f":"IF(('Order Form'!$E$15=\"YES\"),'Order Form'!$E$12,\"\")","v":0},{"$f":"'Order Form'!$E$13 & \"\"","v":""},{"$f":"IF('Order Form'!D317=\"\",'Order Form'!C317,'Order Form'!D317) & \"\"","v":""},{"$f":"'Order Form'!E317 & \"\"","v":""},{"$f":"'Order Form'!F317","v":0},{"$f":"'Order Form'!I317","v":0},{"$f":"'Order Form'!G317","v":0},{"$f":"'Order Form'!H317","v":0},{"$f":"'Order Form'!J317 & \"\"","v":""},{"$f":"'Order Form'!L317 & \"\"","v":""},{"$f":"'Order Form'!C317 & \"\"","v":""},{"$f":"'Order Form'!K317 & \"\"","v":""},{"$f":"'Order Form'!$E$14","v":"YES"},{"$f":"'Order Form'!$E$19","v":0},{"$f":"'Order Form'!$E$16","v":"FREE gift card"},{"$f":"'Order Form'!$E$17","v":"No thanks"},"No","No",{"$f":"\"Dispatch Week: \"&'Order Form'!$E$18","v":"Dispatch Week: "},{"$f":"\"VIP: \"&'Order Form'!$E$5 &\"; Rib: \"&'Order Form'!$E$17 &\"; GT: \"&'Order Form'!$E$16","v":"VIP: ; Rib: No thanks; GT: FREE gift card"},null,null,null,{"$f":"IF(P297=\"\",\"\",IFERROR(INDIRECT(\"Postcodes!$C\"&SUMPRODUCT(--(Postcodes!$A$2:$A$100<=P297)*(Postcodes!$B$2:$B$100>=P297), ROW(Postcodes!$A$2:$A$100))),\"WRONG CODE\"))","v":0},null,null,null,null,null,null,""]
[{"$f":"'Order Form'!A318","v":297},{"$f":"'Order Form'!M318","v":""},{"$f":"'Order Form'!$E$4","v":0},{"$f":"'Order Form'!$E$5","v":0},{"$f":"'Order Form'!$E$6","v":0},{"$f":"'Order Form'!$E$7","v":0},{"$f":"'Order Form'!$E$9","v":0},{"$f":"'Order Form'!$E$8","v":0},{"$f":"'Order Form'!$E$10","v":0},{"$f":"'Order Form'!$E$11","v":0},{"$f":"IF(('Order Form'!$E$15=\"YES\"),'Order Form'!$E$12,\"\")","v":0},{"$f":"'Order Form'!$E$13 & \"\"","v":""},{"$f":"IF('Order Form'!D318=\"\",'Order Form'!C318,'Order Form'!D318) & \"\"","v":""},{"$f":"'Order Form'!E318 & \"\"","v":""},{"$f":"'Order Form'!F318","v":0},{"$f":"'Order Form'!I318","v":0},{"$f":"'Order Form'!G318","v":0},{"$f":"'Order Form'!H318","v":0},{"$f":"'Order Form'!J318 & \"\"","v":""},{"$f":"'Order Form'!L318 & \"\"","v":""},{"$f":"'Order Form'!C318 & \"\"","v":""},{"$f":"'Order Form'!K318 & \"\"","v":""},{"$f":"'Order Form'!$E$14","v":"YES"},{"$f":"'Order Form'!$E$19","v":0},{"$f":"'Order Form'!$E$16","v":"FREE gift card"},{"$f":"'Order Form'!$E$17","v":"No thanks"},"No","No",{"$f":"\"Dispatch Week: \"&'Order Form'!$E$18","v":"Dispatch Week: "},{"$f":"\"VIP: \"&'Order Form'!$E$5 &\"; Rib: \"&'Order Form'!$E$17 &\"; GT: \"&'Order Form'!$E$16","v":"VIP: ; Rib: No thanks; GT: FREE gift card"},null,null,null,{"$f":"IF(P298=\"\",\"\",IFERROR(INDIRECT(\"Postcodes!$C\"&SUMPRODUCT(--(Postcodes!$A$2:$A$100<=P298)*(Postcodes!$B$2:$B$100>=P298), ROW(Postcodes!$A$2:$A$100))),\"WRONG CODE\"))","v":0},null,null,null,null,null,null,""]
[{"$f":"'Order Form'!A319","v":298},{"$f":"'Order Form'!M319","v":""},{"$f":"'Order Form'!$E$4","v":0},{"$f":"'Order Form'!$E$5","v":0},{"$f":"'Order Form'!$E$6","v":0},{"$f":"'Order Form'!$E$7","v":0},{"$f":"'Order Form'!$E$9","v":0},{"$f":"'Order Form'!$E$8","v":0},{"$f":"'Order Form'!$E$10","v":0},{"$f":"'Order Form'!$E$11","v":0},{"$f":"IF(('Order Form'!$E$15=\"YES\"),'Order Form'!$E$12,\"\")","v":0},{"$f":"'Order Form'!$E$13 & \"\"","v":""},{"$f":"IF('Order Form'!D319=\"\",'Order Form'!C319,'Order Form'!D319) & \"\"","v":""},{"$f":"'Order Form'!E319 & \"\"","v":""},{"$f":"'Order Form'!F319","v":0},{"$f":"'Order Form'!I319","v":0},{"$f":"'Order Form'!G319","v":0},{"$f":"'Order Form'!H319","v":0},{"$f":"'Order Form'!J319 & \"\"","v":""},{"$f":"'Order Form'!L319 & \"\"","v":""},{"$f":"'Order Form'!C319 & \"\"","v":""},{"$f":"'Order Form'!K319 & \"\"","v":""},{"$f":"'Order Form'!$E$14","v":"YES"},{"$f":"'Order Form'!$E$19","v":0},{"$f":"'Order Form'!$E$16","v":"FREE gift card"},{"$f":"'Order Form'!$E$17","v":"No thanks"},"No","No",{"$f":"\"Dispatch Week: \"&'Order Form'!$E$18","v":"Dispatch Week: "},{"$f":"\"VIP: \"&'Order Form'!$E$5 &\"; Rib: \"&'Order Form'!$E$17 &\"; GT: \"&'Order Form'!$E$16","v":"VIP: ; Rib: No thanks; GT: FREE gift card"},null,null,null,{"$f":"IF(P299=\"\",\"\",IFERROR(INDIRECT(\"Postcodes!$C\"&SUMPRODUCT(--(Postcodes!$A$2:$A$100<=P299)*(Postcodes!$B$2:$B$100>=P299), ROW(Postcodes!$A$2:$A$100))),\"WRONG CODE\"))","v":0},null,null,null,null,null,null,""]
[{"$f":"'Order Form'!A320","v":299},{"$f":"'Order Form'!M320","v":""},{"$f":"'Order Form'!$E$4","v":0},{"$f":"'Order Form'!$E$5","v":0},{"$f":"'Order Form'!$E$6","v":0},{"$f":"'Order Form'!$E$7","v":0},{"$f":"'Order Form'!$E$9","v":0},{"$f":"'Order Form'!$E$8","v":0},{"$f":"'Order Form'!$E$10","v":0},{"$f":"'Order Form'!$E$11","v":0},{"$f":"IF(('Order Form'!$E$15=\"YES\"),'Order Form'!$E$12,\"\")","v":0},{"$f":"'Order Form'!$E$13 & \"\"","v":""},{"$f":"IF('Order Form'!D320=\"\",'Order Form'!C320,'Order Form'!D320) & \"\"","v":""},{"$f":"'Order Form'!E320 & \"\"","v":""},{"$f":"'Order Form'!F320","v":0},{"$f":"'Order Form'!I320","v":0},{"$f":"'Order Form'!G320","v":0},{"$f":"'Order Form'!H320","v":0},{"$f":"'Order Form'!J320 & \"\"","v":""},{"$f":"'Order Form'!L320 & \"\"","v":""},{"$f":"'Order Form'!C320 & \"\"","v":""},{"$f":"'Order Form'!K320 & \"\"","v":""},{"$f":"'Order Form'!$E$14","v":"YES"},{"$f":"'Order Form'!$E$19","v":0},{"$f":"'Order Form'!$E$16","v":"FREE gift card"},{"$f":"'Order Form'!$E$17","v":"No thanks"},"No","No",{"$f":"\"Dispatch Week: \"&'Order Form'!$E$18","v":"Dispatch Week: "},{"$f":"\"VIP: \"&'Order Form'!$E$5 &\"; Rib: \"&'Order Form'!$E$17 &\"; GT: \"&'Order Form'!$E$16","v":"VIP: ; Rib: No thanks; GT: FREE gift card"},null,null,null,{"$f":"IF(P300=\"\",\"\",IFERROR(INDIRECT(\"Postcodes!$C\"&SUMPRODUCT(--(Postcodes!$A$2:$A$100<=P300)*(Postcodes!$B$2:$B$100>=P300), ROW(Postcodes!$A$2:$A$100))),\"WRONG CODE\"))","v":0},null,null,null,null,null,null,""]
[{"$f":"'Order Form'!A321","v":300},{"$f":"'Order Form'!M321","v":""},{"$f":"'Order Form'!$E$4","v":0},{"$f":"'Order Form'!$E$5","v":0},{"$f":"'Order Form'!$E$6","v":0},{"$f":"'Order Form'!$E$7","v":0},{"$f":"'Order Form'!$E$9","v":0},{"$f":"'Order Form'!$E$8","v":0},{"$f":"'Order Form'!$E$10","v":0},{"$f":"'Order Form'!$E$11","v":0},{"$f":"IF(('Order Form'!$E$15=\"YES\"),'Order Form'!$E$12,\"\")","v":0},{"$f":"'Order Form'!$E$13 & \"\"","v":""},{"$f":"IF('Order Form'!D321=\"\",'Order Form'!C321,'Order Form'!D321) & \"\"","v":""},{"$f":"'Order Form'!E321 & \"\"","v":""},{"$f":"'Order Form'!F321","v":0},{"$f":"'Order Form'!I321","v":0},{"$f":"'Order Form'!G321","v":0},{"$f":"'Order Form'!H321","v":0},{"$f":"'Order Form'!J321 & \"\"","v":""},{"$f":"'Order Form'!L321 & \"\"","v":""},{"$f":"'Order Form'!C321 & \"\"","v":""},{"$f":"'Order Form'!K321 & \"\"","v":""},{"$f":"'Order Form'!$E$14","v":"YES"},{"$f":"'Order Form'!$E$19","v":0},{"$f":"'Order Form'!$E$16","v":"FREE gift card"},{"$f":"'Order Form'!$E$17","v":"No thanks"},"No","No",{"$f":"\"Dispatch Week: \"&'Order Form'!$E$18","v":"Dispatch Week: "},{"$f":"\"VIP: \"&'Order Form'!$E$5 &\"; Rib: \"&'Order Form'!$E$17 &\"; GT: \"&'Order Form'!$E$16","v":"VIP: ; Rib: No thanks; GT: FREE gift card"},null,null,null,{"$f":"IF(P301=\"\",\"\",IFERROR(INDIRECT(\"Postcodes!$C\"&SUMPRODUCT(--(Postcodes!$A$2:$A$100<=P301)*(Postcodes!$B$2:$B$100>=P301), ROW(Postcodes!$A$2:$A$100))),\"WRONG CODE\"))","v":0},null,null,null,null,null,null,""]
[{"$f":"'Order Form'!A322","v":301},{"$f":"'Order Form'!M322","v":""},{"$f":"'Order Form'!$E$4","v":0},{"$f":"'Order Form'!$E$5","v":0},{"$f":"'Order Form'!$E$6","v":0},{"$f":"'Order Form'!$E$7","v":0},{"$f":"'Order Form'!$E$9","v":0},{"$f":"'Order Form'!$E$8","v":0},{"$f":"'Order Form'!$E$10","v":0},{"$f":"'Order Form'!$E$11","v":0},{"$f":"IF(('Order Form'!$E$15=\"YES\"),'Order Form'!$E$12,\"\")","v":0},{"$f":"'Order Form'!$E$13 & \"\"","v":""},{"$f":"IF('Order Form'!D322=\"\",'Order Form'!C322,'Order Form'!D322) & \"\"","v":""},{"$f":"'Order Form'!E322 & \"\"","v":""},{"$f":"'Order Form'!F322","v":0},{"$f":"'Order Form'!I322","v":0},{"$f":"'Order Form'!G322","v":0},{"$f":"'Order Form'!H322","v":0},{"$f":"'Order Form'!J322 & \"\"","v":""},{"$f":"'Order Form'!L322 & \"\"","v":""},{"$f":"'Order Form'!C322 & \"\"","v":""},{"$f":"'Order Form'!K322 & \"\"","v":""},{"$f":"'Order Form'!$E$14","v":"YES"},{"$f":"'Order Form'!$E$19","v":0},{"$f":"'Order Form'!$E$16","v":"FREE gift card"},{"$f":"'Order Form'!$E$17","v":"No thanks"},"No","No",{"$f":"\"Dispatch Week: \"&'Order Form'!$E$18","v":"Dispatch Week: "},{"$f":"\"VIP: \"&'Order Form'!$E$5 &\"; Rib: \"&'Order Form'!$E$17 &\"; GT: \"&'Order Form'!$E$16","v":"VIP: ; Rib: No thanks; GT: FREE gift card"},null,null,null,{"$f":"IF(P302=\"\",\"\",IFERROR(INDIRECT(\"Postcodes!$C\"&SUMPRODUCT(--(Postcodes!$A$2:$A$100<=P302)*(Postcodes!$B$2:$B$100>=P302), ROW(Postcodes!$A$2:$A$100))),\"WRONG CODE\"))","v":0},null,null,null,null,null,null,""]

{"sheet":"VALUES","index":2,"n_rows":128,"n_cols":20,"rows_kept":128,"cut":false,"hidden":true,"merged":[]}
["No thanks","FREE gift card","ACT","YES","HAMPERS",null,null,null,null,null,null,null,null,null,null,null,null,null,null,"ASAP"]
["Silver on Red\n($5 per hamper)","No Cards","NSW","NO","Anzac Ciders Hamper","330a","Repeat Customer","YES",null,null,null,null,null,null,null,null,null,null,null,"Monday, 1st Apr 2019"]
["Gold on Red\n($5 per hamper)","Gift Tag 1 (generic) \n$3 per hamper","QLD",null,"Beers of Australia Hamper","341a","Google Search","NO",null,null,null,null,null,null,null,null,null,null,null,"Tuesday, 2nd Apr 2019"]
["Silver on Green\n($5 per hamper)","Gift Tag 1 (personalised with recipients name)\n$3 per hamper","SA",null,"Barossa Shiraz & Chocolates","206c-3","Recommended by a friend",null,null,null,null,null,null,null,null,null,null,null,null,"Wednesday, 3rd Apr 2019"]
["Gold on Green\n($5 per hamper)","Gift Tag 2 (generic)\n$3 per hamper","TAS",null,"Chandon Celebration Hamper","205c","I received a hamper as a gift",null,"ASAP (order with branding can take up to 3 business days to dispatch)",null,null,null,null,null,null,null,null,null,null,"Thursday, 4th Apr 2019"]
["Silver on Black\n($5 per hamper)","Gift Tag 2 (personalised with recipients name)\n$3 per hamper","VIC",null,"Chandon with Australian Chocolates & Nuts","206c","Advertising",null,"Monday 1st April",null,null,null,null,null,null,null,null,null,null,"Friday, 5th Apr 2019"]
["Gold on Black\n($5 per hamper)","Gift Tag 3 (generic)\n$3 per hamper","WA",null,"Classic Port  Hamper","107a-4",null,null,"Monday 8th April",null,null,null,null,null,null,null,null,null,null,"Monday, 8th Apr 2019"]
["Silver on Blue\n($5 per hamper)","Gift Tag 3 (personalised with recipient name)\n$3 per hamper","NT",null,"Corona Beer Hamper","360a",null,null,"Monday 15th April",null,null,null,null,null,null,null,null,null,null,"Tuesday, 9th Apr 2019"]
["Gold on Blue\n($5 per hamper)","Gift Tag 4 (generic)\n$3 per hamper",null,null,"Entertainer' Gourmet Hamper","101a",null,null,"Monday 22nd April",null,null,null,null,null,null,null,null,null,null,"Wednesday, 10th Apr 2019"]
["Silver on Navy\n($5 per hamper)","Gift Tag 4 (personalised with recipient name)\n$3 per hamper","Standard",null,"Foodies Hamper","107a",null,null,"Monday 29th April",null,null,null,null,null,null,null,null,null,null,"Thursday, 11th Apr 2019"]
["Gold on Navy\n($5 per hamper)","Gift Tag 5 (generic)\n$3 per hamper","Express",null,"Glenmorangie 'The Lasanta' Hamper","107a-3",null,null,"Monday 6th May",null,null,null,null,null,null,null,null,null,null,"Friday, 12th Apr 2019"]
["Silver on Tangerine\n($5 per hamper)","Gift Tag 5 (personalised with recipient name)\n$3 per hamper",null,null,"Glenmorangie 10 Year Original with Whisky Tumblers","206c-5",null,null,"Monday 13th May",null,null,null,null,null,null,null,null,null,null,"Monday, 15th Apr 2019"]
["Gold on Tangerine\n($5 per hamper)","Gift Tag 6 (generic)\n$3 per hamper",null,null,"Glenmorangie Quinta Ruban Hamper","104a-2",null,null,"Monday 20th May",null,null,null,null,null,null,null,null,null,null,"Tuesday, 16th Apr 2019"]
["Silver on Purple\n($5 per hamper)","Gift Tag 6 (personalised with recipient name)\n$3 per hamper",null,null,"Glenmorangie Whisky Tasting Hamper","110a-1",null,null,"Monday 27th May",null,null,null,null,null,null,null,null,null,null,"Wednesday, 17th Apr 2019"]
["Gold on Purple\n($5 per hamper)","Gift Tag 7 (generic)\n$3 per hamper",null,null,"James Squire Ale Hamper","342a",null,null,"Monday 3rd June",null,null,null,null,null,null,null,null,null,null,"Thursday, 18th Apr 2019"]
[null,"Gift Tag 7 (personalised with recipient name)\n$3 per hamper",null,null,"Jurlique 'You Guide, You Love, You Glow' Hamper","231c-p",null,null,"Monday 10th June",null,null,null,null,null,null,null,null,null,null,"Tuesday, 23rd Apr 2019"]
[null,"Gift Tag 8 (generic)\n$3 per hamper",null,null,"Jurlique & Personalised Leather Hamper","230c-p",null,null,"Monday 17th June",null,null,null,null,null,null,null,null,null,null,"Wednesday, 24th Apr 2019"]
[null,"Gift Tag 8 (personalised with recipient name)\n$3 per hamper",null,null,"Jurlique Pure Indulgence Hamper","215c-2",null,null,"Monday 24th June",null,null,null,null,null,null,null,null,null,null,"Friday, 26th Apr 2019"]
[null,"Gift Tag 9 (generic)\n$3 per hamper",null,null,"L'Occitane & Moet Hamper","215c-9",null,null,"Monday 1st July",null,null,null,null,null,null,null,null,null,null,"Monday, 29th Apr 2019"]
[null,"Gift Tag 9 (personalised with recipient name)\n$3 per hamper",null,null,"L'Occitane Pamper Hamper","215c",null,null,"Monday 8th July",null,null,null,null,null,null,null,null,null,null,"Tuesday, 30th Apr 2019"]
[null,"Gift Tag 10 (generic)\n$3 per hamper",null,null,"Luxury Chocolate & Veuve Hamper","210c-1",null,null,"Monday 15th July",null,null,null,null,null,null,null,null,null,null,"Wednesday, 1st May 2019"]
[null,"Gift Tag 10 (personalised with recipient name)\n$3 per hamper",null,null,"Luxury Hennessey Hamper","107a-2",null,null,"Monday 22nd July",null,null,null,null,null,null,null,null,null,null,"Thursday, 2nd May 2019"]
[null,"Gift Tag 11 (generic)\n$3 per hamper",null,null,"Men's Retreat Hamper","407a",null,null,"Monday 29th July",null,null,null,null,null,null,null,null,null,null,"Friday, 3rd May 2019"]
[null,"Gift Tag 11 (personalised with recipient name)\n$3 per hamper",null,null,"Men's Retreat Hamper with Wine","407a-1",null,null,"Monday 5th August",null,null,null,null,null,null,null,null,null,null,"Monday, 6th May 2019"]
[null,"Gift Tag 12 (generic)\n$3 per hamper",null,null,"MicroBreweries of Australia Hamper","340a",null,null,"Monday 12th August",null,null,null,null,null,null,null,null,null,null,"Tuesday, 7th May 2019"]
[null,"Gift Tag 12 (personalised with recipient name)\n$3 per hamper",null,null,"Moët & Cape Mentelle Shiraz Hamper ","206c-13",null,null,"Monday 19th August",null,null,null,null,null,null,null,null,null,null,"Wednesday, 8th May 2019"]
[null,"I want to send cards to include in each hamper \n",null,null,"Moet & Gourmet Nibbles Hamper","100a-9",null,null,"Monday 26th August",null,null,null,null,null,null,null,null,null,null,"Thursday, 9th May 2019"]
[null,null,null,null,"Moët Grand Vintage & Chocolates","206c-08",null,null,"Monday 2nd September",null,null,null,null,null,null,null,null,null,null,"Friday, 10th May 2019"]
[null,null,null,null,"Moet Nectar Imperial Hamper","210c-2",null,null,"Monday 9th September",null,null,null,null,null,null,null,null,null,null,"Monday, 13th May 2019"]
[null,null,null,null,"Moët Rosé Impérial & Gourmet Nibbles","100a-91",null,null,"Monday 16th September",null,null,null,null,null,null,null,null,null,null,"Tuesday, 14th May 2019"]
[null,null,null,null,"Moet with Australian Chocolates & Nuts","206c-1",null,null,"Monday 23rd September",null,null,null,null,null,null,null,null,null,null,"Wednesday, 15th May 2019"]
[null,null,null,null,"Premium Red & White Wine Hamper","100a-3",null,null,"Monday 30th September",null,null,null,null,null,null,null,null,null,null,"Thursday, 16th May 2019"]
[null,null,null,null,"Red Wine & Nibbles Hamper  ","100a",null,null,null,null,null,null,null,null,null,null,null,null,null,"Friday, 17th May 2019"]
[null,null,null,null,"Sweet Bites Hamper","201c",null,null,null,null,null,null,null,null,null,null,null,null,null,"Monday, 20th May 2019"]
[null,null,null,null,"The Best of All Gourmet Hampers","104a",null,null,null,null,null,null,null,null,null,null,null,null,null,"Tuesday, 21st May 2019"]
[null,null,null,null,"The Classic Celebration Hamper","190c",null,null,null,null,null,null,null,null,null,null,null,null,null,"Wednesday, 22nd May 2019"]
[null,null,null,null,"The Emporium Hamper","118c",null,null,null,null,null,null,null,null,null,null,null,null,null,"Thursday, 23rd May 2019"]
[null,null,null,null,"The Retreat Women's Hamper","400a",null,null,null,null,null,null,null,null,null,null,null,null,null,"Friday, 24th May 2019"]
[null,null,null,null,"The Sweet Epicure Hamper","210c",null,null,null,null,null,null,null,null,null,null,null,null,null,"Monday, 27th Mar 2019"]
[null,null,null,null,"Ultimate Foodies Hamper","108c",null,null,null,null,null,null,null,null,null,null,null,null,null,"Tuesday, 28th Mar 2019"]
[null,null,null,null,"Ultimate Foodies Hamper with Shiraz","108c-2",null,null,null,null,null,null,null,null,null,null,null,null,null,"Wednesday, 29th Mar 2019"]
[null,null,null,null,"Ultimate Foodies with Moët Hamper","108c-1",null,null,null,null,null,null,null,null,null,null,null,null,null,"Thursday, 30th Mar 2019"]
[null,null,null,null,"Vintage Moet Hamper","104a-1",null,null,null,null,null,null,null,null,null,null,null,null,null,"Friday, 31st Mar 2019"]
[null,null,null,null,"White Wine Nibbles Hamper","100a-1",null,null,null,null,null,null,null,null,null,null,null,null,null,"Monday, 3rd Jun 2019"]
[null,null,null,null,null,null,null,null,null,null,null,null,null,null,null,null,null,null,null,"Tuesday, 4th Jun 2019"]
[null,null,null,null,"BABY HAMPERS",null,null,null,null,null,null,null,null,null,null,null,null,null,null,"Wednesday, 5th Jun 2019"]
[null,null,null,null,"Blue Knit Blanket & Sophie Hamper","526a-Blue",null,null,null,null,null,null,null,null,null,null,null,null,null,"Thursday, 6th Jun 2019"]
[null,null,null,null,"Champagne Pink Baby Hamper","515a-1",null,null,null,null,null,null,null,null,null,null,null,null,null,"Friday, 7th Jun 2019"]
[null,null,null,null,"Glitter the Unicorn Hamper","522a",null,null,null,null,null,null,null,null,null,null,null,null,null,"Tuesday, 11th Jun 2019"]
[null,null,null,null,"Guess How Much I Love You Baby Boy Hamper","500a-Blue",null,null,null,null,null,null,null,null,null,null,null,null,null,"Wednesday, 12th Jun 2019"]
[null,null,null,null,"Guess How Much I Love You' & Champagne Boy Hamper","501a-Blue",null,null,null,null,null,null,null,null,null,null,null,null,null,"Thursday, 13th Jun 2019"]
[null,null,null,null,"Guess How Much I Love You' & Champagne Girl Hamper","501a-Pink",null,null,null,null,null,null,null,null,null,null,null,null,null,"Friday, 14th Jun 2019"]
[null,null,null,null,"Guess How Much I Love You' & Champagne Hamper","501a-Yellow",null,null,null,null,null,null,null,null,null,null,null,null,null,"Monday, 17th Jun 2019"]
[null,null,null,null,"Guess How Much I Love You' Baby Girl Hamper","500a-Pink",null,null,null,null,null,null,null,null,null,null,null,null,null,"Tuesday, 18th Jun 2019"]
[null,null,null,null,"Guess How Much I Love You' Baby Hamper","500a-Yellow",null,null,null,null,null,null,null,null,null,null,null,null,null,"Wednesday, 19th Jun 2019"]
[null,null,null,null,"Gumnut Babies & Jurlique Hamper","519a-1",null,null,null,null,null,null,null,null,null,null,null,null,null,"Thursday, 20th Jun 2019"]
[null,null,null,null,"Gumnut Babies Hamper","519a",null,null,null,null,null,null,null,null,null,null,null,null,null,"Friday, 21th Jun 2019"]
[null,null,null,null,"Jurlique & Orla Kiely Baby Hamper","516a-1",null,null,null,null,null,null,null,null,null,null,null,null,null,"Monday, 24th Jun 2019"]
[null,null,null,null,"Jurlique All in White Baby Hamper","524a",null,null,null,null,null,null,null,null,null,null,null,null,null,"Tuesday, 25th Jun 2019"]
[null,null,null,null,"Jurlique All in White Baby Hamper with Champagne ","524a-1",null,null,null,null,null,null,null,null,null,null,null,null,null,"Wednesday, 26th Jun 2019"]
[null,null,null,null,"Little Bubba Bathtime Hamper in Grey","503a-Grey",null,null,null,null,null,null,null,null,null,null,null,null,null,"Thursday, 27th Jun 2019"]
[null,null,null,null,"Little Bubba Bathtime Hamper in Navy","503a-Navy",null,null,null,null,null,null,null,null,null,null,null,null,null,"Friday, 28th Jun 2019"]
[null,null,null,null,"Little Bubba Bathtime Hamper in Pink","503a-Pink",null,null,null,null,null,null,null,null,null,null,null,null,null,"Monday, 1st Jul 2019"]
[null,null,null,null,"Natural Collection Baby Hamper","532a",null,null,null,null,null,null,null,null,null,null,null,null,null,"Tuesday, 2nd Jul 2019"]
[null,null,null,null,"Nature's Child Bath Time Natural Baby Hamper","530a",null,null,null,null,null,null,null,null,null,null,null,null,null,"Wednesday, 3rd Jul 2019"]
[null,null,null,null,"Newborn Baby Girl Hamper","515a",null,null,null,null,null,null,null,null,null,null,null,null,null,"Thursday, 4th Jul 2019"]
[null,null,null,null,"Organic and Natural Baby Hamper","531a",null,null,null,null,null,null,null,null,null,null,null,null,null,"Friday, 5th Jul 2019"]
[null,null,null,null,"Orla Kiely Baby Journal Hamper","516a",null,null,null,null,null,null,null,null,null,null,null,null,null,"Monday, 8th Jul 2019"]
[null,null,null,null,"Paddington Bear & PureBaby Hamper","510a",null,null,null,null,null,null,null,null,null,null,null,null,null,"Tuesday, 9th Jul 2019"]
[null,null,null,null,"Personalised 'Baby's First Shoes' Hamper in Baby Blue","511a-LightBlue",null,null,null,null,null,null,null,null,null,null,null,null,null,"Wednesday, 10th Jul 2019"]
[null,null,null,null,"Peter Rabbit Baby Hamper","509a_2",null,null,null,null,null,null,null,null,null,null,null,null,null,"Thursday, 11th Jul 2019"]
[null,null,null,null,"Pink Knit Blanket & Sophie Hamper","526a-Pink",null,null,null,null,null,null,null,null,null,null,null,null,null,"Friday, 12th Jul 2019"]
[null,null,null,null,"Sophie & Mo√´t Hamper","518a",null,null,null,null,null,null,null,null,null,null,null,null,null,"Monday, 15th Jul 2019"]
[null,null,null,null,"Sophie La Girafe & PureBaby Hamper Navy","505a-1",null,null,null,null,null,null,null,null,null,null,null,null,null,"Tuesday, 16th Jul 2019"]
[null,null,null,null,"Sophie La Girafe & PureBaby Hamper Red","505a-2",null,null,null,null,null,null,null,null,null,null,null,null,null,"Wednesday, 17th Jul 2019"]
[null,null,null,null,"Sparkling Pink Baby Hamper","515a-2",null,null,null,null,null,null,null,null,null,null,null,null,null,"Thursday, 18th Jul 2019"]
[null,null,null,null,"Teddy & Blanket Baby Boy Hamper","525a-Blue",null,null,null,null,null,null,null,null,null,null,null,null,null,"Friday, 19th Jul 2019"]
[null,null,null,null,"Thank You Co Baby Bath Grey Hamper","507a-Grey",null,null,null,null,null,null,null,null,null,null,null,null,null,"Monday, 22nd Jul 2019"]
[null,null,null,null,"Thank You Co Baby Bath Navy Hamper","507a-Navy",null,null,null,null,null,null,null,null,null,null,null,null,null,"Tuesday, 23rd Jul 2019"]
[null,null,null,null,"Thank You Co Baby Bath Pink Hamper","507a-Pink",null,null,null,null,null,null,null,null,null,null,null,null,null,"Wednesday, 24th Jul 2019"]
[null,null,null,null,"The Aromatherapy Co Baby Bathtime Hamper","504a",null,null,null,null,null,null,null,null,null,null,null,null,null,"Thursday, 25th Jul 2019"]
[null,null,null,null,"The Aromatherapy Co Baby Nourishing Hamper","504a-1",null,null,null,null,null,null,null,null,null,null,null,null,null,"Friday, 26th Jul 2019"]
[null,null,null,null,"What Little Boys Are Made of","523a",null,null,null,null,null,null,null,null,null,null,null,null,null,"Monday, 29th Jul 2019"]
[null,null,null,null,"Where's The Green Sheep Baby Hamper","517a",null,null,null,null,null,null,null,null,null,null,null,null,null,"Tuesday, 30th Jul 2019"]
[null,null,null,null,null,null,null,null,null,null,null,null,null,null,null,null,null,null,null,"Wednesday, 31st Jul 2019"]
[null,null,null,null,"Custom Hamper",699,null,null,null,null,null,null,null,null,null,null,null,null,null,"Thursday, 1st Aug 2019"]
[null,null,null,null,null,null,null,null,null,null,null,null,null,null,null,null,null,null,null,"Friday, 2nd Aug 2019"]
[null,null,null,null,null,null,null,null,null,null,null,null,null,null,null,null,null,null,null,"Monday, 5th Aug 2019"]
[null,null,null,null,null,null,null,null,null,null,null,null,null,null,null,null,null,null,null,"Tuesday, 6th Aug 2019"]
[null,null,null,null,null,null,null,null,null,null,null,null,null,null,null,null,null,null,null,"Wednesday, 7th Aug 2019"]
[null,null,null,null,null,null,null,null,null,null,null,null,null,null,null,null,null,null,null,"Thursday, 8th Aug 2019"]
[null,null,null,null,null,null,null,null,null,null,null,null,null,null,null,null,null,null,null,"Friday, 9th Aug 2019"]
[null,null,null,null,null,null,null,null,null,null,null,null,null,null,null,null,null,null,null,"Monday, 12th Aug 2019"]
[null,null,null,null,null,null,null,null,null,null,null,null,null,null,null,null,null,null,null,"Tuesday, 13th Aug 2019"]
[null,null,null,null,null,null,null,null,null,null,null,null,null,null,null,null,null,null,null,"Wednesday, 14th Aug 2019"]
[null,null,null,null,null,null,null,null,null,null,null,null,null,null,null,null,null,null,null,"Thursday, 15th Aug 2019"]
[null,null,null,null,null,null,null,null,null,null,null,null,null,null,null,null,null,null,null,"Friday, 16th Aug 2019"]
[null,null,null,null,null,null,null,null,null,null,null,null,null,null,null,null,null,null,null,"Monday, 19th Aug 2019"]
[null,null,null,null,null,null,null,null,null,null,null,null,null,null,null,null,null,null,null,"Tuesday, 20th Aug 2019"]
[null,null,null,null,null,null,null,null,null,null,null,null,null,null,null,null,null,null,null,"Wednesday, 21st Aug 2019"]
[null,null,null,null,null,null,null,null,null,null,null,null,null,null,null,null,null,null,null,"Thursday, 22nd Aug 2019"]
[null,null,null,null,null,null,null,null,null,null,null,null,null,null,null,null,null,null,null,"Friday, 23rd Aug 2019"]
[null,null,null,null,null,null,null,null,null,null,null,null,null,null,null,null,null,null,null,"Monday, 26th Aug 2019"]
[null,null,null,null,null,null,null,null,null,null,null,null,null,null,null,null,null,null,null,"Tuesday, 27th Aug 2019"]
[null,null,null,null,null,null,null,null,null,null,null,null,null,null,null,null,null,null,null,"Wednesday, 28th Aug 2019"]
[null,null,null,null,null,null,null,null,null,null,null,null,null,null,null,null,null,null,null,"Thursday, 29th Aug 2019"]
[null,null,null,null,null,null,null,null,null,null,null,null,null,null,null,null,null,null,null,"Friday, 30th Aug 2019"]
[null,null,null,null,null,null,null,null,null,null,null,null,null,null,null,null,null,null,null,"Monday, 2nd Sept 2019"]
[null,null,null,null,null,null,null,null,null,null,null,null,null,null,null,null,null,null,null,"Tuesday, 3rd Sept 2019"]
[null,null,null,null,null,null,null,null,null,null,null,null,null,null,null,null,null,null,null,"Wednesday, 4th Sept 2019"]
[null,null,null,null,null,null,null,null,null,null,null,null,null,null,null,null,null,null,null,"Thursday, 5th Sept 2019"]
[null,null,null,null,null,null,null,null,null,null,null,null,null,null,null,null,null,null,null,"Friday, 6th Sept 2019"]
[null,null,null,null,null,null,null,null,null,null,null,null,null,null,null,null,null,null,null,"Monday, 9th Sept 2019"]
[null,null,null,null,null,null,null,null,null,null,null,null,null,null,null,null,null,null,null,"Tuesday, 10th Sept 2019"]
[null,null,null,null,null,null,null,null,null,null,null,null,null,null,null,null,null,null,null,"Wednesday, 11th Sept 2019"]
[null,null,null,null,null,null,null,null,null,null,null,null,null,null,null,null,null,null,null,"Thursday, 12th Sept 2019"]
[null,null,null,null,null,null,null,null,null,null,null,null,null,null,null,null,null,null,null,"Friday, 13th Sept 2019"]
[null,null,null,null,null,null,null,null,null,null,null,null,null,null,null,null,null,null,null,"Monday, 16th Sept 2019"]
[null,null,null,null,null,null,null,null,null,null,null,null,null,null,null,null,null,null,null,"Tuesday, 17th Sept 2019"]
[null,null,null,null,null,null,null,null,null,null,null,null,null,null,null,null,null,null,null,"Wednesday, 18th Sept 2019"]
[null,null,null,null,null,null,null,null,null,null,null,null,null,null,null,null,null,null,null,"Thursday, 19th Sept 2019"]
[null,null,null,null,null,null,null,null,null,null,null,null,null,null,null,null,null,null,null,"Friday, 20th Sept 2019"]
[null,null,null,null,null,null,null,null,null,null,null,null,null,null,null,null,null,null,null,"Monday, 23rd Sept 2019"]
[null,null,null,null,null,null,null,null,null,null,null,null,null,null,null,null,null,null,null,"Tuesday, 24th Sept 2019"]
[null,null,null,null,null,null,null,null,null,null,null,null,null,null,null,null,null,null,null,"Wednesday, 25th Sept 2019"]
[null,null,null,null,null,null,null,null,null,null,null,null,null,null,null,null,null,null,null,"Thursday, 26th Sept 2019"]
[null,null,null,null,null,null,null,null,null,null,null,null,null,null,null,null,null,null,null,"Friday, 27th Sept 2019"]
[null,null,null,null,null,null,null,null,null,null,null,null,null,null,null,null,null,null,null,"Monday, 30th Sept 2019"]

{"sheet":"Postcodes","index":3,"n_rows":71,"n_cols":4,"rows_kept":71,"cut":false,"hidden":true,"merged":[]}
["From Post Code","To Post Code","Standard","Express"]
[2485,2485,"Standard Delivery with Australia Post","Premium Delivery"]
[9700,9799,"Test","Premium Delivery"]
[9400,9596,"Standard Delivery with Australia Post","Premium Delivery"]
[9000,9299,"Standard Delivery with Australia Post","Premium Delivery"]
[4500,4549,"Standard Delivery with Australia Post","Premium Delivery"]
[4000,4209,"Standard Delivery with Australia Post","Premium Delivery"]
[4210,4229,"Standard Delivery with Australia Post","Premium Delivery"]
[4300,4307,"Standard Delivery with Australia Post","Premium Delivery"]
[4550,4575,"Standard Delivery with Australia Post","Premium Delivery"]
[9880,9919,"Standard Delivery with Australia Post","Express Delivery"]
[9597,9599,"Standard Delivery with Australia Post","Express Delivery"]
[4576,4689,"Standard Delivery with Australia Post","Express Delivery"]
[4308,4449,"Standard Delivery with Australia Post","Express Delivery"]
[4230,4299,"Standard Delivery with Australia Post","Express Delivery"]
[9920,9999,"Standard Delivery with Australia Post","Express Delivery"]
[4690,4899,"Standard Delivery with Australia Post","Express Delivery"]
[4450,4499,"Standard Delivery with Australia Post","Express Delivery"]
[2890,2890,"Standard Delivery with Australia Post","Premium Sydney Delivery"]
[2740,2786,"Standard Delivery with Australia Post","Premium Sydney Delivery"]
[2555,2574,"Standard Delivery with Australia Post","Premium Sydney Delivery"]
[1000,2249,"Standard Delivery with Australia Post","Premium Sydney Delivery"]
[2250,2263,"Standard Delivery with Australia Post","Premium Delivery"]
[2515,2530,"Standard Delivery with Australia Post","Premium Delivery"]
[2500,2506,"Standard Delivery with Australia Post","Premium Delivery"]
[2282,2310,"Standard Delivery with Australia Post","Premium Delivery"]
[2900,2920,"Standard Delivery with Australia Post","Premium Delivery"]
[2600,2620,"Standard Delivery with Australia Post","Premium Delivery"]
[200,299,"Standard Delivery with Australia Post","Premium Delivery"]
[2531,2554,"Standard Delivery with Australia Post","Express Delivery"]
[2507,2514,"Standard Delivery with Australia Post","Express Delivery"]
[2486,2499,"Standard Delivery with Australia Post","Express Delivery"]
[2311,2484,"Standard Delivery with Australia Post","Express Delivery"]
[2921,2999,"Standard Delivery with Australia Post","Express Delivery"]
[2264,2281,"Standard Delivery with Australia Post","Express Delivery"]
[2891,2898,"Standard Delivery with Australia Post","Express Delivery"]
[2787,2889,"Standard Delivery with Australia Post","Express Delivery"]
[2621,2739,"Standard Delivery with Australia Post","Express Delivery"]
[2575,2599,"Standard Delivery with Australia Post","Express Delivery"]
[2899,2899,"Standard Delivery with Australia Post","Express Delivery"]
[3335,3343,"Standard Delivery with Australia Post","Premium Delivery"]
[8000,8999,"Standard Delivery with Australia Post","Premium Delivery"]
[3000,3213,"Standard Delivery with Australia Post","Premium Delivery"]
[3980,3983,"Standard Delivery with Australia Post","Premium Delivery"]
[3972,3978,"Standard Delivery with Australia Post","Premium Delivery"]
[3926,3944,"Standard Delivery with Australia Post","Premium Delivery"]
[3910,3920,"Standard Delivery with Australia Post","Premium Delivery"]
[3750,3811,"Standard Delivery with Australia Post","Premium Delivery"]
[3425,3443,"Standard Delivery with Australia Post","Premium Delivery"]
[3345,3345,"Standard Delivery with Australia Post","Premium Delivery"]
[3214,3220,"Standard Delivery with Australia Post","Premium Delivery"]
[3353,3356,"Standard Delivery with Australia Post","Premium Delivery"]
[3350,3350,"Standard Delivery with Australia Post","Premium Delivery"]
[3812,3909,"Standard Delivery with Australia Post","Express Delivery"]
[3444,3749,"Standard Delivery with Australia Post","Express Delivery"]
[3357,3424,"Standard Delivery with Australia Post","Express Delivery"]
[3351,3352,"Standard Delivery with Australia Post","Express Delivery"]
[3221,3334,"Standard Delivery with Australia Post","Express Delivery"]
[3984,3999,"Standard Delivery with Australia Post","Express Delivery"]
[3979,3979,"Standard Delivery with Australia Post","Express Delivery"]
[3945,3971,"Standard Delivery with Australia Post","Express Delivery"]
[3921,3925,"Standard Delivery with Australia Post","Express Delivery"]
[5800,5999,"Standard Delivery with Australia Post","Premium Delivery"]
[5000,5199,"Standard Delivery with Australia Post","Premium Delivery"]
[5200,5749,"Standard Delivery with Australia Post","Express Delivery"]
[6000,6205,"Standard Delivery with Australia Post","Premium Delivery"]
[6800,6999,"Standard Delivery with Australia Post","Premium Delivery"]
[6206,6699,"Standard Delivery with Australia Post","Express Delivery"]
[6700,6797,"Standard Delivery with Australia Post","Express Delivery"]
[7000,7999,"Standard Delivery with Australia Post","Express Delivery"]
["0800","0999","Standard Delivery with Australia Post","Express Delivery"]